Skip to end of metadata
Go to start of metadata
DateDec 10, 2018
Issues54525 issues


Summary



Important highlights from this release


All updates for this release

Epic

New Feature

  • JENKINS-55090 OPEN Administrative monitor to recommend to use MySQL instead of embedded H2
  • JENKINS-55083 OPEN Evaluate environment variables in declarative stage conditions
  • JENKINS-55065 OPEN Support a fallback/backup auth mechanism
  • JENKINS-55058 OPEN Show all tasks as separate build stage in Blueocean
  • JENKINS-55056 OPEN Use of net.sf.json.JSONObject can lead to invalid marathon.json generation
  • JENKINS-55051 OPEN Support for D-Scanner format
  • JENKINS-55048 OPEN Jenkins core should check plugin Minimum Java requirements in Update Center metadata
  • JENKINS-55041 IN PROGRESS Adding a new configuration to the azure-vm-agents-plugin that allows adding a User Assigned Identity to a VM
  • JENKINS-55037 OPEN Allow configuration/filtering of detected Changes
  • JENKINS-55017 OPEN Allow advanced configuration for other s3 providers
  • JENKINS-55007 OPEN How do I have more then one parameter on a single line for parameterized jobs?
  • JENKINS-54996 OPEN Immediate setup of SCM polling when using CpsScmFlowDefinition
  • JENKINS-54995 OPEN Jenkins Upgrade plugins without restart
  • JENKINS-54959 OPEN Offer a new Unarchive installer which takes Java archive structure into account
  • JENKINS-54935 CLOSED Adding a new configuration to the azure-vm-agents-plugin to add VM to AAD security group
  • JENKINS-54930 OPEN withEnv should accept Map as well as List
  • JENKINS-54908 OPEN allow delay of starting new instances
  • JENKINS-54907 IN PROGRESS Provide a default JFR Dockerfile for Java 11 images
  • JENKINS-54906 OPEN Custom WAR Packager should produce Java 11-compatible JFR images
  • JENKINS-54891 CLOSED how to get href link
  • JENKINS-54878 OPEN remove items not managed by job-dsl
  • JENKINS-54872 OPEN Pipeline doesnt' provide override global maven configuration option but Multibranch pipeline does
  • JENKINS-54862 IN REVIEW PCT: Add support of passing plugin version overrides
  • JENKINS-54861 OPEN don't trigger initial build after branch detection
  • JENKINS-54857 OPEN Allow durable task to run batch/shell/powershell files from the repo
  • JENKINS-54845 IN REVIEW CLI command to trigger downstream pipelines based on given maven artifact
  • JENKINS-54780 OPEN Support JCASC in Publish Over FTP plugin
  • JENKINS-54779 OPEN Publish site reports
  • JENKINS-54760 OPEN Allow the users to specify the test results path
  • JENKINS-54751 OPEN Expose SCM changes as environment variables
  • JENKINS-54726 OPEN add gerrit code review as a scm tool
  • JENKINS-54723 OPEN EC2 Plugin: Include tags in created EBS volumes
  • JENKINS-54722 OPEN add backlink to gerrit code review to overview page for every build
  • JENKINS-54721 OPEN Show changelog messages for review changes
  • JENKINS-54675 OPEN PCT: Add reporting of the used JDK version to the report
  • JENKINS-54674 RESOLVED PCT: Add Docker packaging for Java 11
  • JENKINS-54669 CLOSED Use sensible defaults settings for the datasource configuration
  • JENKINS-54594 OPEN Add support for credentials binding plugin for ocp bearer token
  • JENKINS-54572 OPEN Add SSH connection support for Docker Plugin
  • JENKINS-54567 OPEN Last deployed/published/finished column
  • JENKINS-54544 OPEN Allow Pipeline to add Badges to BlueOcean
  • JENKINS-54539 CLOSED REST API to generate API tokens
  • JENKINS-54519 CLOSED resolved
  • JENKINS-54490 OPEN Mention postbuild plugin in 'manager' Globals description
  • JENKINS-54487 OPEN Offer Java 11 Alpine Docker images for Jenkins agents
  • JENKINS-54463 OPEN add JCasC pipeline step
  • JENKINS-54462 RESOLVED PCT: Add support of running CLI with Java 11
  • JENKINS-54461 OPEN Grant Job Rerun in a Pipeline as a Individual Permission
  • JENKINS-54442 OPEN Show origin class, repository, plugin of globals
  • JENKINS-54441 OPEN Display class and plugin for workflow steps
  • JENKINS-54439 IN PROGRESS Support configuration as code plugin
  • JENKINS-54433 OPEN do we have view based permission partitioning strategy for jenkins?
  • JENKINS-54418 OPEN Ability to select images based on OS_FAMILY and select lastest version
  • JENKINS-54404 CLOSED google compute engine plugin support "stopped mode"
  • JENKINS-54395 OPEN Snapshot management feature in GCE-plugin
  • JENKINS-54384 OPEN consider adding pipeline-maven to essentials
  • JENKINS-54383 OPEN consider adding bitbucket-oauth and github-oauth to Evergreen
  • JENKINS-54380 CLOSED Private repository authentication
  • JENKINS-54373 OPEN Quality Gate failure doesn't fail the step.
  • JENKINS-54368 IN REVIEW Jenkins Tests Recovery operations support
  • JENKINS-54344 OPEN Add an AdministrativeMonitor to check/warn critical aspects of an Evergreen instance
  • JENKINS-54337 OPEN consider adding job-dsl to Evergreen
  • JENKINS-54336 RESOLVED consider adding pipeline-utility-steps-plugin to Evergreen
  • JENKINS-54327 OPEN Go back to previous stage in pipeline if failed/aborted in particular stage
  • JENKINS-54316 OPEN Update plugins defined in package-config.yml of CWP
  • JENKINS-54303 OPEN Pipeline zip does not suport symbolic links
  • JENKINS-54284 CLOSED Add `@Symbol` to warning parsers
  • JENKINS-54265 OPEN Sending Parameters or initialize environment variables
  • JENKINS-54245 OPEN Jenkins windows installer should offer Open java jdk
  • JENKINS-54237 CLOSED Issue in created merged Result.html file
  • JENKINS-54227 RESOLVED Safely expose the Cause(s) associated with the current build
  • JENKINS-54208 OPEN Groovy compilation error in Splunk Plugin Extension
  • JENKINS-54183 OPEN support multiple alm octane shared spaces configuration
  • JENKINS-54163 OPEN Email-Ext 2.63: brokenBuildSuspects recipient provider is not working for pipeline builds
  • JENKINS-54159 IN PROGRESS Support configuration as code plugin
  • JENKINS-54158 OPEN Pipeline supports regression report plugin
  • JENKINS-54153 RESOLVED Creating workspace without sync?
  • JENKINS-54152 OPEN restart jenkins when not running as service
  • JENKINS-54149 CLOSED Ability to add HTML text on login page
  • JENKINS-54072 OPEN extension point to write comments to SCM pull request
  • JENKINS-54057 OPEN [JEP-302] Implement evergreen Data auto-rollback using the snapshotting system
  • JENKINS-54056 RESOLVED Implement Evergreen automated Update Level rollback

Improvement

  • JENKINS-55091 IN PROGRESS Pipeline - Provide better type information
  • JENKINS-55089 OPEN Add a lineSeparator step
  • JENKINS-55087 OPEN Revert the Java 11 Experimental Update Center patches in the Docker image
  • JENKINS-55086 IN PROGRESS Jenkins Docker should use the Java 11 Experimental update center when running with Java 11
  • JENKINS-55085 OPEN Revert the Java 11 Experimental Update Center patches in the core
  • JENKINS-55084 OPEN Cloud Statistics does not show EC2 instance information
  • JENKINS-55080 IN REVIEW Jenkins should use Java 11 Experimental update center when running with Java 11
  • JENKINS-55063 OPEN Warnings 5.0 Custom Parser documentation confusing, missing info on (multibranch) pipline usage.
  • JENKINS-55050 OPEN Performance improvement for large archive symlink outside of workspace
  • JENKINS-55045 OPEN performance optimization
  • JENKINS-55035 OPEN SImplify security realms
  • JENKINS-55032 OPEN Improve Logging onf SonarQubePointGenerator
  • JENKINS-55031 OPEN Deactivate undesired Genrators
  • JENKINS-55029 OPEN Allow target=_blank for links in OWASP Markup Formatter Plugin ("Safe HTML" formatter) under conditions
  • JENKINS-55021 OPEN ghprb-plugin compatibility with Configuration as Code
  • JENKINS-55020 OPEN poll using build parameters
  • JENKINS-55019 OPEN GitHub Organization Plugin - Decouple Config Changes from Full Scan
  • JENKINS-55018 OPEN Change log is not up to date
  • JENKINS-55005 OPEN gerrit-trigger
  • JENKINS-55001 OPEN Sandboxed System Groovy Scripts don't support multiple assignments (with Tuples)
  • JENKINS-54975 RESOLVED Add java 11 documentation to the ATH repo
  • JENKINS-54973 OPEN Not able to generate build With Xcode 10
  • JENKINS-54972 OPEN Build Changelogs don't expose SCM Name for Git repo
  • JENKINS-54968 OPEN Branch API 2.1.1 Path Length
  • JENKINS-54964 RESOLVED Add debugging documentation to the ATH repo
  • JENKINS-54963 OPEN select which test runs to put in the chart instead of last n
  • JENKINS-54960 OPEN Closure-less overloads in DefaultGroovyMethods should be whitelisted
  • JENKINS-54949 OPEN parameter to add current plugin to custom war
  • JENKINS-54945 OPEN Single agent and step(s) for multiple parallel steps
  • JENKINS-54944 OPEN Add Build Time to Dashboard Portlet
  • JENKINS-54941 OPEN missing whitelist: String.valueO(int)
  • JENKINS-54939 OPEN Full Name not accurately populated when using PAM authentication
  • JENKINS-54933 IN REVIEW Replace ZeroClipboard (Flash) with native JavaScript implementation
  • JENKINS-54931 OPEN Support rundeck 3.0
  • JENKINS-54900 REOPENED Concurrent security RBAC
  • JENKINS-54890 RESOLVED A Pipeline should be able to recover from an exception thrown in a GraphListener
  • JENKINS-54880 OPEN Cannot update credentials in a pipeline created by bluce ocean
  • JENKINS-54877 OPEN missing elements in job dsl 'organizationFolder'
  • JENKINS-54870 OPEN Allow "Publish cppCheck results" for failed builds
  • JENKINS-54868 OPEN Display Organization/Project and Repository name(s) on the job details page
  • JENKINS-54858 OPEN Detect working directory from build output
  • JENKINS-54854 OPEN Warning when trigger spent to much time in a cron execution
  • JENKINS-54850 OPEN ParameterizedJobMixIn.scheduleBuild2 default quiet parameter should be available as a static constant
  • JENKINS-54842 OPEN Find and add Java 9+ signatures for Animal Sniffer
  • JENKINS-54836 OPEN create a local user in jenkins with admin privilages
  • JENKINS-54834 OPEN Create a Dependabot equivalent for CWP plugin lists or add support of Jenkins updates to pom.xml
  • JENKINS-54828 IN PROGRESS Plugin POM: Support building the code with Java level 11
  • JENKINS-54807 OPEN Maven HPI Plugin or Plugin POM should automatically set up Java 11 environment
  • JENKINS-54785 OPEN Allow users to configure SCM hosts that will be ignored
  • JENKINS-54778 OPEN add usage of new Error severity in Trend graphics
  • JENKINS-54777 OPEN PCT: Add specific user to run PCT from Docker image
  • JENKINS-54766 IN REVIEW Missing target dependency to sue demo-* targets
  • JENKINS-54762 OPEN Show output from reconcile -w -f step of Auto Cleanup and Sync
  • JENKINS-54759 FIXED BUT UNRELEASED Groovy Parsers - improve help text
  • JENKINS-54749 OPEN Support for multipart/form-data content-type in POST requests
  • JENKINS-54745 OPEN Specify font size, or automatically scale it as plot size grows
  • JENKINS-54743 IN REVIEW Contribute JIRA_URL environment variable
  • JENKINS-54736 OPEN Show errors of pmd.xml file
  • JENKINS-54735 OPEN Pipeline retry clause: optionally delay between retries
  • JENKINS-54715 OPEN EC2 Plugin: Possibility to provide AWS account id when using EC2 instance profile to obtain credentials
  • JENKINS-54714 OPEN Allow downloading raw CSV data for external processing
  • JENKINS-54707 OPEN Allow setting of P4IGNORE to alternate names
  • JENKINS-54706 OPEN Drop support for themes
  • JENKINS-54702 OPEN Discover Bitbucket repo when receiving first webhook event
  • JENKINS-54701 CLOSED Support branch indexing and branch event trigger causes
  • JENKINS-54697 OPEN How to use 'p4 print' with P4Groovy?
  • JENKINS-54693 OPEN Improve doCheckUpdatesServer: logs, internal logic
  • JENKINS-54692 OPEN system cloud podTemplate support defaultContainer
  • JENKINS-54687 CLOSED GCLogs should be excluded by default
  • JENKINS-54686 RESOLVED Use trilead-api plugin instead trilead-ssh2 from core
  • JENKINS-54685 OPEN data ecomony
  • JENKINS-54682 OPEN Allow configuration of listen address for JNLP agents
  • JENKINS-54666 OPEN vsphere plugin job succesful but VMs in vcenter not created
  • JENKINS-54665 OPEN Allow vSphere credentials overridable from job config page.
  • JENKINS-54662 IN PROGRESS hudson.model.UsageStatistics not compatible with CasC plugin
  • JENKINS-54653 OPEN Ability to retrieve metrics by type in the metric servlet
  • JENKINS-54650 OPEN Allow for value inspection of urltrigger responses
  • JENKINS-54649 OPEN Allow logging of urltrigger response
  • JENKINS-54648 OPEN Allow url-trigger basic authentication to use jenkins stored credentials
  • JENKINS-54647 OPEN Plugin is not working in downstream jobs
  • JENKINS-54645 REOPENED Send queue data in JSON Payload
  • JENKINS-54635 OPEN Add ability to specify auth path during login
  • JENKINS-54633 IN REVIEW build dedicated VPC while installing evergreen on AWS
  • JENKINS-54631 OPEN Update JaCoCo Maven Plugin to support Coverage publishing with Java 11
  • JENKINS-54608 OPEN [BuildResultTrigger] Add multi-configuration project child jobs to the list of job to monitor
  • JENKINS-54606 OPEN Make container warning more intelligent
  • JENKINS-54605 OPEN Default stage for post section
  • JENKINS-54602 RESOLVED Pipeline post action should support conditions
  • JENKINS-54600 OPEN Show a warning when creating a user with a dot
  • JENKINS-54599 IN REVIEW Update Jetty version in Maven Jenkins Dev Plugin (Jetty)
  • JENKINS-54584 FIXED BUT UNRELEASED Wrong icon for move/delete and move/add action changes page
  • JENKINS-54581 OPEN Possibility to limit the amount of executed configurations of a matrix job
  • JENKINS-54580 OPEN Possibility to define a maximum value for jobs with identical parameters
  • JENKINS-54579 OPEN Allow the max builds value to be a parameter
  • JENKINS-54550 OPEN Add usage of new Error severity in Quality Gate Thresholds
  • JENKINS-54546 OPEN Missing policy violations column
  • JENKINS-54545 RESOLVED Promisify the plugin deletion
  • JENKINS-54540 OPEN Pods stuck in error state is not cleaned up
  • JENKINS-54536 IN REVIEW Support T3 instance types
  • JENKINS-54527 OPEN Replace "Build now" button with "Build with parameters" if pipeline has parameters
  • JENKINS-54523 RESOLVED Ability to stop an UNSTABLE declarative pipeline
  • JENKINS-54505 OPEN Expose plugin manager to groovy
  • JENKINS-54496 OPEN Node monitoring should not log exceptions for disconnected nodes
  • JENKINS-54495 OPEN Better handling of GitHub Organization folder scan to avoid API quota
  • JENKINS-54489 OPEN Don't use RandomStringGenerator for suffix in instance name
  • JENKINS-54488 CLOSED Lightweight checkout workspace
  • JENKINS-54467 OPEN Evergreen AWS flavor security hardening
  • JENKINS-54459 RESOLVED Avoid Angry Jenkins when check now on Plugin Manager
  • JENKINS-54455 OPEN Provide howto for adding plugins to Evergreen
  • JENKINS-54450 OPEN Adding the ability to "undeploy" an application from a container
  • JENKINS-54446 OPEN support bitbucket non saml url
  • JENKINS-54445 REOPENED Publishing data to influxDb
  • JENKINS-54440 OPEN Bump PostgreSQL driver
  • JENKINS-54437 CLOSED Add support for MySql database
  • JENKINS-54434 IN PROGRESS Bump MySql driver to v8.x
  • JENKINS-54424 RESOLVED Jenkinsfile Runner: Stop using Jenkins Test Harness dependency
  • JENKINS-54422 OPEN Ability to specify custom message per Action
  • JENKINS-54410 RESOLVED Compatibility of Blue Ocean ATH with pre- and post-2.128 login screens from classic
  • JENKINS-54381 OPEN Allow to specify a different team when creating a pipeline
  • JENKINS-54359 IN PROGRESS Change error handling
  • JENKINS-54356 RESOLVED Make Pipeline placeholder tasks expose the same info as Freestyle builds do
  • JENKINS-54353 OPEN Jenkinsfile Runner: Replace the JUnit implementation but something production-focused
  • JENKINS-54352 OPEN Create basic functional tests for Jenkinsfile Runner
  • JENKINS-54351 RESOLVED Enable Maven Enforcer in the Jenkinsfile Runner codebase
  • JENKINS-54350 RESOLVED Java 11 compatibility: Update JTH to the recent version
  • JENKINS-54332 OPEN New Parameters option, specifying separate parameters for each separate job
  • JENKINS-54325 IN REVIEW Support multiple SimplePageDecorators for login and signup page footers
  • JENKINS-54324 OPEN Notifications for the input directive
  • JENKINS-54323 OPEN Create a Pipeline step to set the current build's display name, description, etc.
  • JENKINS-54322 OPEN Add ability SKIP stage in script pipeline
  • JENKINS-54317 OPEN change NAT timeout
  • JENKINS-54297 OPEN Failing to report build status to BitBucket server
  • JENKINS-54279 OPEN Forward slash should not be appended to URLs
  • JENKINS-54276 OPEN blueocean does not confirm build stop/cancel
  • JENKINS-54250 OPEN Disable restarting stages in jenkinsfile optionally
  • JENKINS-54247 OPEN Add to TROUBLESHOOTING how to backup/restore current keys
  • JENKINS-54239 OPEN jobDSL for warnings column in view
  • JENKINS-54231 OPEN job dsl summary hides multiple jobs with the same display name
  • JENKINS-54221 IN REVIEW Add an example of a certificate authentication with service-principal to documentation
  • JENKINS-54220 OPEN Include node name in Pipeline Run Details View
  • JENKINS-54214 OPEN NPE when no credentials provided on Gerrit SCM URL for Declarative Pipeline
  • JENKINS-54212 OPEN Jenkins Gerrit webhook not working for refUpdated events
  • JENKINS-54211 OPEN List all available apis in the app
  • JENKINS-54201 OPEN Allow the tigger to work without any "node" wrappers
  • JENKINS-54197 OPEN Allow combining site and room fields
  • JENKINS-54195 OPEN Add support for p4 clean
  • JENKINS-54194 OPEN Support paging for Jenkins pipelines based views
  • JENKINS-54193 CLOSED Ability to limit number of pipelines shown in Jenkins pipeline based views
  • JENKINS-54192 CLOSED Add missing help description for sorting and number of columns configuration options
  • JENKINS-54191 CLOSED Persist task finished time
  • JENKINS-54188 IN PROGRESS Allow "tool locations" to be configured per Azure Virtual Machine Template
  • JENKINS-54182 OPEN How to get maven model properties like env vars in maven plugin?
  • JENKINS-54171 IN PROGRESS Git parameter branch selector becomes slow after a period of time
  • JENKINS-54164 OPEN Support onDelete build event to optionally delete image from registry
  • JENKINS-54154 IN REVIEW [Custom Tools Plugin] - JCasC compatibility
  • JENKINS-54151 RESOLVED Update CWP to JCasC 1.0
  • JENKINS-54150 OPEN Add config option to ignore certificate errors
  • JENKINS-54145 OPEN Removed dependencies are not removed from list of upstream projects
  • JENKINS-54137 CLOSED Do not submit empty telemetry data
  • JENKINS-54136 CLOSED Use per-trial correlator IDs
  • JENKINS-54129 OPEN Jump Hosts need their own configuration
  • JENKINS-54127 OPEN Add new option to pipeline - sshagent
  • JENKINS-54125 OPEN Jenkinsfile lightweight checkout help doesn't match behaviour - polling and changelog work without checkout scm
  • JENKINS-54122 CLOSED Jenkins failing to list the changes detected from git repositories
  • JENKINS-54070 CLOSED Support for Jenkinsfile declarative pipelines
  • JENKINS-54060 OPEN Compatibility with Jenkins 2.x

Bug

  • JENKINS-55099 OPEN Mailer Plugin PCT fails on 2.150...2.155
  • JENKINS-55098 OPEN Build Flow: Non-fatal issues when running plugin builds with JDK 11 (Powermock tests)
  • JENKINS-55097 OPEN PCT cannot efficiently run tests in Docker due to SUREFIRE-1588
  • JENKINS-55096 OPEN can not override j
  • JENKINS-55094 OPEN "commands" and "args" are being defaulted using Kubernetes plugin
  • JENKINS-55093 OPEN multi branch job limit offset issue
  • JENKINS-55092 OPEN linter for Jenkinsfile doesn't detect misspelled parameter names
  • JENKINS-55088 OPEN Jenkins Home config.xml reset upon restart
  • JENKINS-55082 OPEN No @DataBoundConstructor on io.jenkins.jenkinsfile.runner.FileSystemSCM
  • JENKINS-55081 IN REVIEW Correct flaky test xxx904Test
  • JENKINS-55079 FIXED BUT UNRELEASED Plugin Manager API page suggest invalid prevalidateConfig link (typo)
  • JENKINS-55078 OPEN No longer able to start ECS slaves
  • JENKINS-55076 IN PROGRESS Java version discovery should be using java.specification.version instead of java.version
  • JENKINS-55075 OPEN Pipeline: If job fails it will run again on next poll.
  • JENKINS-55074 OPEN basic-branch-build-strategies adds invalid configuration to GitHub organization
  • JENKINS-55073 CLOSED Matrix-Based security - own permission not listed anymore
  • JENKINS-55072 OPEN bitbucket-webhooks Plugin wrong url
  • JENKINS-55071 OPEN Slow branch scan when using Bitbucket source
  • JENKINS-55070 OPEN "Jenkins.instance is missing" error when restarting Jenkins
  • JENKINS-55069 OPEN An error regarding SecurityRealm occurred when build test job
  • JENKINS-55068 IN PROGRESS Multibranch scanning deletes jobs if bitbucket server goes away during scan
  • JENKINS-55067 OPEN ClassNotFoundException: org.jvnet.hudson.maven3.listeners.MavenProjectInfo is occurring again in 3.2
  • JENKINS-55066 OPEN Docker plugin erroneously terminates containers shortly after they start
  • JENKINS-55064 OPEN Pipeline stages display garbage when skipped
  • JENKINS-55062 IN PROGRESS Restarting (and likely loading) screen is missing assets if prefixed infront of proxy
  • JENKINS-55059 OPEN pluginmanager shows Update information obtained: N/A ago
  • JENKINS-55057 OPEN pipeline mail report is giving previous run health report
  • JENKINS-55055 OPEN The dist-fork command hangs when the remote directory contains a FIFO file
  • JENKINS-55053 OPEN Jenkins init script does not stop jenkins if JENKINS_HOME not found
  • JENKINS-55052 REOPENED Different behavior accessing user credentials using RunAs Specific vs. Triggered User
  • JENKINS-55049 IN REVIEW NFE with symlink in artifact
  • JENKINS-55047 OPEN Failed to get _links error when opening blueocean
  • JENKINS-55044 FIXED BUT UNRELEASED Rule 6: org.apache.maven.plugins.enforcer.RequireUpperBoundDeps failed
  • JENKINS-55043 OPEN Fortify Plugin causes JENKINS-45892
  • JENKINS-55042 OPEN email and bitbucket notifications from a non-existent job
  • JENKINS-55040 OPEN Problem sharing data objects between parallel build stages
  • JENKINS-55039 OPEN npm ERR! code UNABLE_TO_VERIFY_LEAF_SIGNATURE
  • JENKINS-55038 RESOLVED `Parameterized Remote Trigger Plugin` sometimes fails with poll interval value more than 5 minutes
  • JENKINS-55036 CLOSED Build Periodically Stopped Working After Plugin Installed
  • JENKINS-55034 OPEN Cannot publish over CIFS from artifact directory using pipeline
  • JENKINS-55033 RESOLVED Jenkins attempts to connect to Windows slave before GCP VM is provisioned
  • JENKINS-55030 CLOSED Listing subfolders under folder is very slow
  • JENKINS-55028 OPEN Jenkins considers build as success even if tower plugin fails
  • JENKINS-55027 OPEN Git plugin requires: Pipeline: SCM Step, Step API
  • JENKINS-55026 OPEN I have installed a ecu test plugin, but there is no ECU Test section in the global tool configuration
  • JENKINS-55025 OPEN issue in "add build steps"
  • JENKINS-55024 OPEN Pipeline Job Plugin (workflow-job-plugin) gives empty console output when an error occurs
  • JENKINS-55023 OPEN Remote ssh slave disconnection
  • JENKINS-55022 REOPENED (windows10+jenkins 2.153) can build project with warnings, but (centos 7+jenkins 2.153) build failed
  • JENKINS-55016 OPEN Fix UtilTest.testDeleteRecursive_onWindows flaky test
  • JENKINS-55015 OPEN Include Custom Message has stopped work with DSL
  • JENKINS-55014 OPEN Deadlocking around support-core-plugin log publishing
  • JENKINS-55012 OPEN Attempt to (de-)serialize anonymous class org.jenkinsci.plugins.configfiles.GlobalConfigFiles$1
  • JENKINS-55011 OPEN Attempt to (de-)serialize anonymous class org.jenkinsci.plugins.configfiles.folder.FolderConfigFileProperty$1
  • JENKINS-55010 IN REVIEW Failure to collect pom.xml file path when using flatten-maven-plugin with a non default "flattenedPomFilename"
  • JENKINS-55009 FIXED BUT UNRELEASED Wrong "sonarBuildLink" URL within SonarQubePointGenerator
  • JENKINS-55008 OPEN P4 Plugin generates ticket on slave that it does not use
  • JENKINS-55006 OPEN /monitoring/nodes?format=prometheus throws error 500
  • JENKINS-55004 CLOSED Avoid calling getLogFile in compress-buildlog-plugin
  • JENKINS-55003 OPEN RAW HTML is shown in last success version column since 2.138.2
  • JENKINS-55002 OPEN Gerrit reports +1 despite one of multiple triggered builds failed
  • JENKINS-55000 OPEN Missing scope for bitbucket hooks registration
  • JENKINS-54999 IN REVIEW Performance issue due to the bundle anonymization feature of the support-core plugin
  • JENKINS-54998 OPEN Stash and archive should resolve symlinks
  • JENKINS-54997 OPEN Deprecated calls to Run.getLogFile
  • JENKINS-54994 OPEN Jenkins always hang few hours
  • JENKINS-54993 OPEN Valgrind result: plugin crash with JellyTagException
  • JENKINS-54992 OPEN Terrifying message makes me think Jenkins will delete my github repo
  • JENKINS-54990 CLOSED 404 on jenkins lts 2.138.2/3 github org workflow/multibranch jobs with github authorization
  • JENKINS-54989 OPEN "No valid crumb was included in the request" just watching a log
  • JENKINS-54988 OPEN jenkins queue is locked (not able to start any build) because KubernetesSlave._terminate stuck
  • JENKINS-54987 OPEN BlueOcean not opening builds created within folders
  • JENKINS-54986 OPEN Pull request build fails with NullPointer exception
  • JENKINS-54985 OPEN Trigger email alerts to multiple mail id in Jenkins
  • JENKINS-54984 OPEN PipelineJob() publishers deprecated - how to send a notifications
  • JENKINS-54983 OPEN Hitting Bitbucket API Rate limit quite easily
  • JENKINS-54982 OPEN Using Java8 Streams evaluates whole expression to Boolean
  • JENKINS-54981 IN PROGRESS Not able to configure/save new jobs. Also old jobs and builds are removed. All we did was restarted the jenkins server. We are getting "javax.servlet.ServletException: java.lang.ArrayIndexOutOfBoundsException: -1" error
  • JENKINS-54980 OPEN Jobs are stopped being triggered - java.lang.NullPointerException: There is no credentials with admin access to manage hooks on GitHubRepositoryName[host=github.com,username=myorgname,repository=myreponame]
  • JENKINS-54979 OPEN email-ext-plugin in Pipeline {JELLY_SCRIPT,template="html"} does not send code changes
  • JENKINS-54978 IN PROGRESS Mobile Center run tests on wrong Device
  • JENKINS-54977 OPEN Failed one of sub-jobs in a phase, but the build went on despite a Success or Unstable setting
  • JENKINS-54976 OPEN Jenkins stops responding to build calls and deadlock is detected in jvm
  • JENKINS-54974 OPEN Jenkins does not start due to a deadlock after upgrade from 2.121.2.2 to 2.138.2.2
  • JENKINS-54971 OPEN Jenkins job hanging suddenly without any failure
  • JENKINS-54970 OPEN On error ssh steps plugin shows clear text password in job log
  • JENKINS-54969 OPEN Unable to view console log - page keeps refreshing without showing anything
  • JENKINS-54967 FIXED BUT UNRELEASED Setting <useSecurity>true</useSecurity> to <useSecurity>false</useSecurity> then back again doesn't turn on user login
  • JENKINS-54962 OPEN Multibranch pipeline does a full clone of the repository for any new branch
  • JENKINS-54961 OPEN Slave workspaces for removed multibranch PRs piling up
  • JENKINS-54958 OPEN Subversion changelog corrupted by parallel checkout with stacktrace at the end of the pipeline
  • JENKINS-54956 OPEN Github merge refs not working correctly
  • JENKINS-54955 OPEN waiting for next available executor for too long
  • JENKINS-54954 OPEN 401 response requesting Quality Gate status
  • JENKINS-54953 OPEN Failed to create folder when going to New Item->Folder
  • JENKINS-54952 OPEN Script Security seems to block ArrayList method as method on members when parantheses are omitted
  • JENKINS-54948 OPEN Dynamic creation of cloud instance for every new trigger irrespective of free executors in existing slave cloud instance
  • JENKINS-54947 OPEN Add help for anonymizing config
  • JENKINS-54943 CLOSED "Failed to create Page Blob with script's length: 0"
  • JENKINS-54940 OPEN brokenBuildSuspects() returns empty list in pipeline script
  • JENKINS-54938 OPEN Free swap space is 0' job failed
  • JENKINS-54936 RESOLVED 0.30 version not yet released for Github Authentication Plugin
  • JENKINS-54934 OPEN Max number of retries and retry wait time do not allow 0
  • JENKINS-54932 OPEN SSC - Octane integration - inject SSC vulnerabilities to Octane is not working correctly
  • JENKINS-54928 OPEN SCM changes are not noticed and SCMpoll starts the build based on the cron.
  • JENKINS-54927 OPEN Job configuration Save/Apply buttons missing
  • JENKINS-54926 OPEN reactive parameters are no longer reacting
  • JENKINS-54924 OPEN Script Runs In Script Console But Not Job DSL
  • JENKINS-54923 OPEN Spawning processes from build on windows server
  • JENKINS-54922 FIXED BUT UNRELEASED Generated markdown should work in MacDown.app
  • JENKINS-54921 OPEN can not release connection
  • JENKINS-54920 OPEN Refactor AboutJenkins class
  • JENKINS-54919 IN REVIEW Newly defined parameters aren't available in Declarative agent configuration on first build
  • JENKINS-54917 CLOSED Github pull request builds created but not triggered
  • JENKINS-54913 OPEN CPS serialization failure - Mysterious serialization errors
  • JENKINS-54912 OPEN TestResult-Section renders imagemap-div's to body
  • JENKINS-54911 OPEN Windows Slave disconnects automatically
  • JENKINS-54910 OPEN Could not able to Build Azure Function APP using MSBuild Plugin
  • JENKINS-54909 CLOSED Parallel Runner execuable cannot be found on Native OS
  • JENKINS-54904 RESOLVED "(hide)" and "(show)" links in console broken in Firefox
  • JENKINS-54903 OPEN Updates through proxy server with authentication not working after update to core 2.152 or higher
  • JENKINS-54902 OPEN Github Enterprise webhooks not setup when creating a pipeline via blue ocean
  • JENKINS-54901 OPEN Docker registry credentials doesn't apply on multibranch pipeline
  • JENKINS-54899 RESOLVED templates using existing storage account stop working
  • JENKINS-54898 OPEN ECS Plugin 1.18 cannot launch slaves
  • JENKINS-54897 OPEN Unexpected error in launching a agent after restart
  • JENKINS-54896 OPEN Can't get Jenkins to work with proxy under Windows
  • JENKINS-54895 OPEN Jenkins build used wrong commit number
  • JENKINS-54894 OPEN Server becomes compute bound and unresponsive to http requests after org.jenkinsci.plugins.workflow.support.concurrent.Timeout lambda$ping$0
  • JENKINS-54893 OPEN Error provisioning slaves with ECS plugin 1.18
  • JENKINS-54892 OPEN java.nio.file.AccessDeniedException: C:\Program Files\Java\jdk1.8.0_171\bin\java.exe
  • JENKINS-54889 FIXED BUT UNRELEASED Blue Ocean is throwing an exception in case a Flownode displayname is null
  • JENKINS-54888 OPEN Gearman Plugin should not access extensions from SaveableListener during startup
  • JENKINS-54887 OPEN How can multiple text boxes be created corresponding to each choice done via active choice reactive parameter and how to access them from your jenkins workspace?To be more precise refer as per my attachment
  • JENKINS-54886 OPEN ECS 1.18 plugin fails to launch slaves (not authorized to perform: iam:PassRole)
  • JENKINS-54884 OPEN ssh-slaves or trilead-api stops all git over ssh (git+ssh) from working
  • JENKINS-54883 IN REVIEW Pull-Request Action Details gone after restarting Jenkins
  • JENKINS-54882 OPEN Websphere Deploy Plugin Error ADMC0016E
  • JENKINS-54881 OPEN Stash Notifier Plugin doesn't set the Jenkins Root URL in stash though Jenkins URL is set in Jenkins Location in Global System Configuration
  • JENKINS-54879 OPEN Freestyle job serialization failure
  • JENKINS-54876 OPEN Blueocean doesn't show TestNG Results
  • JENKINS-54875 OPEN Pipeline view "header line" shows escape sequences for echo step
  • JENKINS-54871 FIXED BUT UNRELEASED "java.lang.OutOfMemoryError: unable to create new native thread" running gatling test with maven
  • JENKINS-54869 OPEN Multibranch project truncates cloudbees folder workspace paths
  • JENKINS-54866 OPEN github_branch_source.GitHubSCMSource is ~0 width
  • JENKINS-54865 OPEN Can't store artifacts in the s3 bucket named with dots
  • JENKINS-54864 OPEN github multibranch builds fail to build with latest branch api update
  • JENKINS-54863 OPEN Parallel builds in same workspace
  • JENKINS-54860 OPEN As a vSphere cloud plugin user, I cannot create VM from Jenkins pipeline because template does not have snapshot, not possible in vSphere Version 6.5.0 Build 7070488
  • JENKINS-54859 RESOLVED Branch event java.lang.NullPointerException
  • JENKINS-54856 RESOLVED Got exception after check update
  • JENKINS-54855 OPEN Gitlub plugin doesn't work correctly ,when the job is triggered from "Pipeline Events"
  • JENKINS-54853 OPEN [MC 3.0] [Jenkins Plugin 5.6] Use proxy settings cannot be disalbe.
  • JENKINS-54852 OPEN [MC 3.0] [Jenkins Plugin 5.6] In the Mobile center options specify aunthentication is not valid.
  • JENKINS-54849 OPEN SVN_REVISION and/or SVN_REVISION_X not being set
  • JENKINS-54848 OPEN Support Gherkin jobs in Jenkins - pipeline as code
  • JENKINS-54847 OPEN waitForQualityGate() is not working if analysis is taking more than 30 seconds
  • JENKINS-54846 IN REVIEW RAW HTML is shown in cron column since 2.138.2
  • JENKINS-54844 OPEN Access Modifier Checker 1.16 fails when running with java.level=11
  • JENKINS-54843 RESOLVED Maven Enforcer Plugin crashes with java.level=11
  • JENKINS-54841 CLOSED Invalid characters in changelist triggers SAXParseException
  • JENKINS-54840 OPEN UnsupportedOperationException getLogFile
  • JENKINS-54839 IN REVIEW Match Text not working on GitHub multibranch pipeline for PRs
  • JENKINS-54838 OPEN OWASP Dependency-Check plugin loses trace of bcprov-jdk15on.jar vulnerabilities
  • JENKINS-54837 OPEN Cannot override workspace-volume
  • JENKINS-54835 OPEN Pipeline stage view is showing all stages twice
  • JENKINS-54833 FIXED BUT UNRELEASED Warnings Parser fails parsing log
  • JENKINS-54832 OPEN Groovy Parser cannot access console log
  • JENKINS-54831 CLOSED False-Positive CVE-2017-2604 after update of OWASP Dependency-Check
  • JENKINS-54830 CLOSED Goup mail user are not receiving but shows as recipient list
  • JENKINS-54829 FIXED BUT UNRELEASED Nunit Plugin: MAX_PATH is too long for a few windows systems
  • JENKINS-54786 OPEN Launch command should include an env var for the name of the node
  • JENKINS-54784 CLOSED Database creation failure on MySQL 5.5: "ERROR 1071 (42000): Specified key was too long; max key length is 767 bytes"
  • JENKINS-54783 OPEN Library additions to Global Variable Reference are not displayed formatted
  • JENKINS-54782 CLOSED Change Subversion plugin version over JCASC
  • JENKINS-54781 CLOSED Displayed dao class is wrong in "Global Tool Configuration"
  • JENKINS-54776 IN PROGRESS Node stays suspended after node is started
  • JENKINS-54775 RESOLVED Fix Java 11 build URL
  • JENKINS-54774 OPEN svn: E200015: E200015: ISVNAuthentication provider did not provide credentials
  • JENKINS-54773 OPEN Jacoco plugin 3.0.4 ignores minimum****Coverage options
  • JENKINS-54772 IN REVIEW computer/<name>/systemInfo doesn't report full Environment
  • JENKINS-54771 OPEN NPE in logs after using groovy script to add slave template
  • JENKINS-54770 RESOLVED A new client object is created each time the plugin needs to connection to K8s
  • JENKINS-54769 OPEN Ticket creation fails while trying to set mandatory select list field
  • JENKINS-54768 OPEN not able to save the build job after creating a job of zap and jenkins integration
  • JENKINS-54767 OPEN Global variables are overriding local variables
  • JENKINS-54765 OPEN JEP-200 org.apache.maven.artifact.versioning.ComparableVersion$ListItem
  • JENKINS-54764 OPEN builds fail when using timeout step with the Pipeline Basic Steps Plugin
  • JENKINS-54763 RESOLVED Branch name disappear after plugin upgrade (>= 2.26)
  • JENKINS-54761 OPEN Downstream job not displaying in logs after upstream job is promoted
  • JENKINS-54757 OPEN High CPU caused by dumping the classloader in CpsFlowExecution
  • JENKINS-54756 RESOLVED No page found 'config.jelly' for class org.jenkinsci.plugins.configfiles.GlobalConfigFiles
  • JENKINS-54754 OPEN JellyTestSuiteBuilder complains about escape-by-default
  • JENKINS-54753 FIXED BUT UNRELEASED SV 5.00 is not supported
  • JENKINS-54752 OPEN Ansi plugin fails to render formatted console output
  • JENKINS-54750 OPEN Multiple charts of same type not shown on job summary page
  • JENKINS-54748 OPEN Memory leak in test-results-analyzer causes Jenkins to crash
  • JENKINS-54747 OPEN In Multibranch pipeline job configuration shows and hangs
  • JENKINS-54746 OPEN Can't connect via SSH on 1.29.1
  • JENKINS-54744 OPEN Publish over ssh is not transferring directories created by file operations plugin
  • JENKINS-54742 OPEN Can't load shared library multiple times on parallel stages
  • JENKINS-54741 OPEN JVM version column of agent running Java is blank
  • JENKINS-54740 OPEN Jenkins running build for every branch in repository.
  • JENKINS-54739 OPEN Accessing tests from BlueOcean UI results in http threads pegging cpu in TreeMap.java (put)
  • JENKINS-54738 OPEN Unable to view console because of Jelly error
  • JENKINS-54737 OPEN Internal post stages are not reported in the stage view
  • JENKINS-54734 OPEN Blue Ocean view for pipeline doesn't show strings which contain any job parameter value
  • JENKINS-54733 OPEN After 10 builds Pipeline Stage View disappears.
  • JENKINS-54732 OPEN Revision information produced by pipline 'checkout' operation isn't parallel safe
  • JENKINS-54731 RESOLVED Rename hudson.PluginManager.CHECK_UPDATE_ATTEMPTS property to hudson.PluginManager.checkUpdateAttempts
  • JENKINS-54730 OPEN environment variables are not accessible in downstream job
  • JENKINS-54729 OPEN jenkins dashboard displays stacktrace
  • JENKINS-54728 RESOLVED Jenkins fails to show any page with exception after plugins update
  • JENKINS-54727 RESOLVED Site crash after upgrade to 2.152
  • JENKINS-54725 RESOLVED Do not publish older releases for JDK11 (esp. LTS)
  • JENKINS-54724 RESOLVED ssh-credentials-plugin broken when using ssh-slaves-plugin 1.29.0
  • JENKINS-54720 CLOSED ssh-slaves 1.29.0 causes ClassNotFoundException
  • JENKINS-54719 OPEN Allocating a Node doesn't create a workspace
  • JENKINS-54718 CLOSED Claim plugin does not allow to claim unstable builds with declarative pipeline
  • JENKINS-54717 OPEN Shell script output different from native launch
  • JENKINS-54716 CLOSED ssh-slaves-plugin after update to 1.29.0 svn is no longer aviable as pipeline scm
  • JENKINS-54713 CLOSED UI Exception after upgraden plugins
  • JENKINS-54712 CLOSED after update ssh-slave plugin to 1.29.0 just stacktrace in browser
  • JENKINS-54711 CLOSED jenkins-jobs.mv.db failed
  • JENKINS-54710 OPEN GitException was not retried in shared libraries fetcher
  • JENKINS-54709 CLOSED Docker Agent templates could not chose SSH Credentials
  • JENKINS-54708 CLOSED org.apache.commons.jelly.JellyTagException: jar:file:/C:/Program%20Files%20(x86)/Jenkins/war/WEB-INF/lib/jenkins-core-2.152.jar!/lib/layout/hasPermission.jelly:35:20: <d:invokeBody> com/trilead/ssh2/crypto/Base64
  • JENKINS-54705 OPEN Jenkins slave agent does not start
  • JENKINS-54704 OPEN Problem with some paths (folder) blue ocean jenkins Nginx reverse proxy
  • JENKINS-54703 OPEN Body font-size gets overridden on analysis report page
  • JENKINS-54700 OPEN Findbugs SAXParser not found
  • JENKINS-54699 OPEN Durable Task Version 1.28 break jenkins pipeline
  • JENKINS-54698 OPEN Jenkins in Docker invoke gradle build failed after the local docker become a swarm manager
  • JENKINS-54696 CLOSED handle 502 Octane's response as temporary error for any flow
  • JENKINS-54695 CLOSED every build fail except first one
  • JENKINS-54691 OPEN git plugins error
  • JENKINS-54690 RESOLVED System configuration page error
  • JENKINS-54689 OPEN Incorrect display build duration time
  • JENKINS-54688 RESOLVED Operating System informations are anonymized
  • JENKINS-54684 OPEN ERROR: [Sun Nov 18 07:58:23 UTC 2018] Could not fetch branches from source guid
  • JENKINS-54683 OPEN Pods entering error state
  • JENKINS-54681 OPEN dir('path') is broken when used within "docker.image().inside{}"
  • JENKINS-54680 RESOLVED Compressed build logs not rendering with update to workflow-job plugin >= 2.26
  • JENKINS-54679 OPEN SSHLauncher doesn't continue retrying to connect to remote executor
  • JENKINS-54678 OPEN Compression trick not supported by JEP-210
  • JENKINS-54677 OPEN Switching container does not switch filesystem
  • JENKINS-54676 OPEN Error Creating Flownodes causes Jenkins to not add to queue or mark builds finished
  • JENKINS-54673 OPEN currentBuild.getBuildCauses(type) fails when type is a cause contributed by a plugin
  • JENKINS-54672 OPEN TFS Plugin TFVC Does Not Pull All Project Files to Workspace
  • JENKINS-54671 OPEN Script not found results in success in durable-task-plugin
  • JENKINS-54670 OPEN Continous builds upon bitbuckt pull request
  • JENKINS-54667 OPEN Getting Error while accessing Performance Report
  • JENKINS-54663 OPEN Unable to run Perfromance Center scenario from Jenkins
  • JENKINS-54661 CLOSED DataSource properties are ignored
  • JENKINS-54660 OPEN CPU load at 100% across all cores requires machine restart to resolve
  • JENKINS-54659 OPEN broken layout at setup
  • JENKINS-54657 OPEN dropWhile doesn't behave correctly
  • JENKINS-54656 OPEN cvs plugin broken - not possible to add new projects
  • JENKINS-54655 OPEN declarative library fails to override implicitly loaded library
  • JENKINS-54654 IN REVIEW A recent update breaks builds by escaping slashes to percent signs in workspace paths
  • JENKINS-54652 OPEN [Groovy] Invalid switch case flow on empty "block"
  • JENKINS-54651 FIXED BUT UNRELEASED Refusing to marshal net.sf.json.JSONObject
  • JENKINS-54646 RESOLVED External jars in shared libraries are always executed on master
  • JENKINS-54644 OPEN parameter with null value breaks global env variables
  • JENKINS-54643 OPEN A connection interruption causes the pipeline to fail when USE_WATCHING=true
  • JENKINS-54642 OPEN Problem in saving configuration
  • JENKINS-54641 RESOLVED UnsupportedOperation Flooding Jenkins Master
  • JENKINS-54640 CLOSED Workspace folders are not unique
  • JENKINS-54639 OPEN Multibranch: Delete Pipeline should fail when builds are kept forever
  • JENKINS-54638 OPEN P4 Plugin: "cleanup true" missing cleaning other P4Clients during Parallel Stages
  • JENKINS-54634 CLOSED Jenkins restart wipes out Cucumber Reports
  • JENKINS-54632 OPEN dsl job doesn't create a build step for Performance Center using Jenkins API
  • JENKINS-54630 OPEN Scan Organization Folder fails when a repository is deleted but configured to redirect
  • JENKINS-54629 OPEN Proceed button not working in classic view
  • JENKINS-54628 OPEN Poll error when no view in Manual workspace for stream
  • JENKINS-54627 OPEN Lock label does not work with upstream trigger
  • JENKINS-54626 OPEN Build Issue in Jenkins Multibranch Pipeline Jobs.
  • JENKINS-54625 OPEN FATAL: Could not initialize class com.microsoft.tfs.core.config.persistence.DefaultPersistenceStoreProvider
  • JENKINS-54623 OPEN Jenkins changes config.xml but doesn't pick up the changes on restart
  • JENKINS-54622 CLOSED [MC 3.0] [Jenkins latest Version] when trying to add server for testing in jenkins page, it will return exception "url MUST NOT be null nor empty"
  • JENKINS-54621 OPEN List subversion tags: list branches / tags in subfolders recursively
  • JENKINS-54619 RESOLVED Job import fails with NoClassDefFoundError exception
  • JENKINS-54618 OPEN Pipeline powershell step hangs if a function is called from powershell workflow
  • JENKINS-54617 REOPENED email-ext-plugin in Pipeline does not send email to group email id
  • JENKINS-54616 OPEN TFS checkout gives versionControl exception randomly after updating to 2.151
  • JENKINS-54615 OPEN Periodic java.lang.NullPointerException when collecting details for Pipeline builds
  • JENKINS-54613 CLOSED java.io.NotSerializableException is extremely difficult/impossible to triage
  • JENKINS-54612 OPEN Reference repo not used for Git clones on Windows SSH agents
  • JENKINS-54611 RESOLVED Timestamper does not work properly with Windows style line endings
  • JENKINS-54610 OPEN Race condition when polling for changes triggered by web hook
  • JENKINS-54609 OPEN Approve assuming permission check for parameters change actions
  • JENKINS-54607 RESOLVED Timeout step ignores "Grace Period" before force killing
  • JENKINS-54604 OPEN checkUpdatesServer fails to use SSL
  • JENKINS-54603 CLOSED Memory leak in remoting causes Jenkins to crash
  • JENKINS-54597 CLOSED helloooooo
  • JENKINS-54596 OPEN can't parse argument number: changelog.url
  • JENKINS-54595 CLOSED Adding a new target is not working
  • JENKINS-54593 FIXED BUT UNRELEASED jenkins is hanging after clean the system cache
  • JENKINS-54592 OPEN Sorting arrows show in wrong direction in dashboard
  • JENKINS-54591 CLOSED test
  • JENKINS-54590 FIXED BUT UNRELEASED NPE on CopyArtifact.java line 441 if the job config XML is missing <target>
  • JENKINS-54589 CLOSED Builds are failing with timeout during checkout. Issue will be fixed only after the server restart where Jenkins is installed. Intermittent issue but happening frequently. Please assist on this.
  • JENKINS-54588 OPEN Docker jenkins can't create first user
  • JENKINS-54587 CLOSED Upon restart, MySql driver not registered
  • JENKINS-54586 RESOLVED Cannot mix dockerfile and non docker agents in a pipeline
  • JENKINS-54585 CLOSED SamlSecurityRealm constructor error with argument binding with Groovy
  • JENKINS-54583 OPEN Requests to job view/api trigger failing requests to sonar results
  • JENKINS-54582 OPEN How to get a list of all Freestyle jobs from a Pipeline job?
  • JENKINS-54578 IN REVIEW Cannot delete last category
  • JENKINS-54577 OPEN Remove github server in "Configure System" page does not have any effect
  • JENKINS-54576 RESOLVED hockeapp-plugin fails in pipeline because of missing 'baseUrlHolder'
  • JENKINS-54575 FIXED BUT UNRELEASED JEP-200 Publish Over SSH Plugin
  • JENKINS-54574 CLOSED Err message if not waiting for job to complete
  • JENKINS-54573 OPEN secret file not accesible to containerized stages
  • JENKINS-54571 OPEN Problem with jcasc compatibility plugin and job priority in Jenkins
  • JENKINS-54570 OPEN Duplication of button click when uploading plugin
  • JENKINS-54569 IN REVIEW java.lang.NullPointerException when upding status in TFS/Team Services
  • JENKINS-54568 OPEN authorizationMatrix does not work in declarative snippet generator
  • JENKINS-54566 RESOLVED Failed to execute command Pipe.Flush
  • JENKINS-54565 CLOSED added matrix-bases security plugin, then user, saved and got stack trace
  • JENKINS-54564 OPEN Jenkins master CPU pegs to >= 18% - Killing telemetry collection thread seems to fix it
  • JENKINS-54563 OPEN NPE when connecting via SSH to Docker via hostname
  • JENKINS-54562 FIXED BUT UNRELEASED Jenkins will not start as Window Service error 1053
  • JENKINS-54561 FIXED BUT UNRELEASED Job fails even though it succeeded: Java 10
  • JENKINS-54560 CLOSED InfluxDB cannot collect Sonarqube data
  • JENKINS-54559 CLOSED Build result regression since pipeline-maven 3.5.15 for failing tests (UNSTABLE)
  • JENKINS-54558 OPEN Debian package update failed because setup step tries to restart Jenkins service
  • JENKINS-54557 OPEN hudson.AbortException: Ansible playbook execution failed
  • JENKINS-54556 CLOSED The authorizationMatrix plugin doesent work with pipeline
  • JENKINS-54555 FIXED BUT UNRELEASED 'stage' directive with nested 'when' and 'options' directives executes the 'options' block even if the condition is not met
  • JENKINS-54551 RESOLVED Revert JENKINS-53462 if necessary
  • JENKINS-54549 OPEN gitscm fail for multibranch pipeline after recent plugin upgrade
  • JENKINS-54548 CLOSED Assistance with JQL Format
  • JENKINS-54547 RESOLVED ERROR: Asynchronous execution failure java.util.concurrent.ExecutionException: java.lang.NullPointerException
  • JENKINS-54543 CLOSED Jenkins job doesn't show commits from perforce
  • JENKINS-54541 OPEN Unreserve doesn't set environment variable
  • JENKINS-54538 OPEN Ability to save unmasked credentials to file
  • JENKINS-54537 OPEN Scripted Pipeline does not work due to tags
  • JENKINS-54534 OPEN SSH failing when HTTP proxy is in use
  • JENKINS-54529 CLOSED CAN NOT get build number with jenkins API
  • JENKINS-54528 OPEN Gitlab Enterprise 11 API v3 group no longer supported
  • JENKINS-54526 OPEN jira version 2.150 java.lang.NullPointerException at hudson.scm.CvsRepository.<init>(CvsRepository.java:87)
  • JENKINS-54525 FIXED BUT UNRELEASED java.lang.NullPointerException at hudson.scm.CvsRepository.<init>(CvsRepository.java:87)
  • JENKINS-54524 OPEN Improper Encoding of Sync Status
  • JENKINS-54522 OPEN Host JDK Tool Plugin download failing
  • JENKINS-54521 OPEN vSphere plugin fails to recognise its own VMs
  • JENKINS-54520 OPEN Abort job won't abort publish-over-cifs-plugin step
  • JENKINS-54518 OPEN Multibranch pipeline: Incorrect branch sort order for plain Git sources
  • JENKINS-54517 OPEN Broken links to gitea web UI in Jenkins job sidebar
  • JENKINS-54516 OPEN Repository polling fails when pull requests are disabled
  • JENKINS-54515 RESOLVED master triggers own branches
  • JENKINS-54513 OPEN Builds occupying executor but not running
  • JENKINS-54512 OPEN can not change workspace in k8s pipeline
  • JENKINS-54511 OPEN When using the SpecWorkspaceImpl workspaces are update twice every build
  • JENKINS-54510 OPEN Job dsl doesn't update script approval when job already exists
  • JENKINS-54509 OPEN gerrit trigger parameters description show 'null' on the web
  • JENKINS-54508 CLOSED The <useSecurity>false</useSecurity> changes to <useSecurity>true</useSecurity> in config.xml if the value of the tag has been changed explicitly.
  • JENKINS-54507 CLOSED pipeline_data is not pushing to influxdb
  • JENKINS-54506 OPEN Some compiler warnings are misidentified as Javadoc warnings
  • JENKINS-54504 OPEN Performance issue with promoted builds and Git branch parameter
  • JENKINS-54503 CLOSED Ansible tower plugin 0.9.0 issue with Tower 3.3.1
  • JENKINS-54502 OPEN Jenkins crashed when a build was aborted due to timeout.
  • JENKINS-54501 OPEN ClassCastException in SonarUtils getPersistentActions
  • JENKINS-54500 OPEN Charset not respected in parallel sync
  • JENKINS-54499 OPEN Loosing connection to Docker container
  • JENKINS-54498 CLOSED Version Creation now requires version code which breaks binary compatibility
  • JENKINS-54497 OPEN Too many Bitbucket git checkouts on Master at the same time
  • JENKINS-54494 OPEN Selecting "Use project rule" but leaving the entry field empty, make the job aborted w/o clear pointer to the cause
  • JENKINS-54493 FIXED BUT UNRELEASED ALM Octane CI in Configure System throws exception
  • JENKINS-54492 OPEN checkout scm information no longer injected into environment in pipeline job
  • JENKINS-54486 IN PROGRESS Not created JIRA issue after build failed
  • JENKINS-54485 OPEN Add testing of Demos to Jenkinsfile
  • JENKINS-54484 OPEN JDK11: JBoss marshalling Upgrade to 2.x causes incompatible changes for running Pipelines
  • JENKINS-54483 OPEN Publish html show 404 not found
  • JENKINS-54482 OPEN Sending POST-Request for input-step again lets the pipeline fail
  • JENKINS-54481 RESOLVED [Pipeline Aggregator View] Stages cannot be clicked in
  • JENKINS-54480 OPEN ConcurrentModificationException in CPS VM thread (CpsFlowExecution): org.jenkinsci.plugins.workflow.cps.DSL
  • JENKINS-54479 OPEN androidApkMove not moving Release Notes between Tracks
  • JENKINS-54478 OPEN unable to integrate jenkins cvs
  • JENKINS-54477 OPEN email-ext unable to correctly determine status of pipeline build (especially after JENKINS-27395)
  • JENKINS-54476 OPEN JNLP Agent disconnected, having issues connecting to master.
  • JENKINS-54475 OPEN p4sync hangs at "p4 sync -f -q"
  • JENKINS-54474 OPEN Variables not resolving in SSH Steps plugin
  • JENKINS-54473 CLOSED ECS plugin cannot start Windows containers
  • JENKINS-54472 OPEN Pin build at Perforce Label does not support variable expansion
  • JENKINS-54471 CLOSED Unity3D Plugin -logfile argmuent not creating log file
  • JENKINS-54469 OPEN Unable to set Thread Executor Size when configuring Jira Plugin
  • JENKINS-54468 OPEN Not applicable Branch Build Strategies are available in the Organization UI
  • JENKINS-54466 RESOLVED HPIs should be renamed JPIs after download
  • JENKINS-54465 OPEN Instances sometimes stay disconnected
  • JENKINS-54464 OPEN Customization for Blue Ocean logo
  • JENKINS-54458 OPEN regression in UFT discovery when new Jenkins plugin is used with old Octane - tests are not reported to Octane
  • JENKINS-54457 CLOSED Cucumber Reports not working in Blue Ocean
  • JENKINS-54456 OPEN using repoOwner and configure block creates two organizations
  • JENKINS-54454 RESOLVED evergreen not available after restart on aws
  • JENKINS-54448 IN PROGRESS Azure VM Agent does not work with Custom Managed Image with Unmanaged disk
  • JENKINS-54447 RESOLVED Everyone with limited permissions can read configs
  • JENKINS-54443 OPEN Loadrunner controller not displayed while running the test from Jenkins
  • JENKINS-54438 OPEN Documentation is not generating for wait parameter in build job
  • JENKINS-54436 OPEN change environment variable name: HP_RUN_ID
  • JENKINS-54432 RESOLVED Cannot use Gerrit as anonymous multi-branch source
  • JENKINS-54431 CLOSED Error with Java 11 and jacoco-plugin 3.0.3
  • JENKINS-54430 OPEN Build Job Changes render incorrectly, transforming Jira issue URLs into text instead of links
  • JENKINS-54428 RESOLVED ECS plugin fails if task definition ARN is used
  • JENKINS-54426 OPEN Jenkinsfile Runner fails on Java 11: NoClassDefFoundError: java.sql.Date
  • JENKINS-54425 OPEN "update plugin to a version created with a newer harness" warnings in the default STDOUT
  • JENKINS-54421 RESOLVED Configure page show Oops page after Installation of Artifactory Plugin
  • JENKINS-54417 CLOSED jenkins upgrade to version 2.138.2,error occurred when click the Login button
  • JENKINS-54416 RESOLVED Configure Systems Page Showing Oops Page. Unable to Save
  • JENKINS-54415 OPEN jep-200 issue w/ matrix reloaded plugin
  • JENKINS-54414 RESOLVED NullPointerException when packaging IPA
  • JENKINS-54413 CLOSED DocLinks Uses HTML Frames
  • JENKINS-54411 RESOLVED Configure page show Oops page (/configure)
  • JENKINS-54409 OPEN It doesn;t like my password
  • JENKINS-54408 OPEN docker exec runs as root within docker.image.inside which docker run runs as the jenkins user
  • JENKINS-54407 OPEN docker exec fails within docker.image.inside because of empty environment variable name
  • JENKINS-54406 OPEN [JEP-200] Failed to serialize class
  • JENKINS-54405 RESOLVED New Relic Deployment Notifier Plugin fails to notify New Relic of Deployment
  • JENKINS-54403 OPEN Job fail when GitHub tag was recreated
  • JENKINS-54402 FIXED BUT UNRELEASED Pipeline Syntax page is missing the dropdown for supported parsers
  • JENKINS-54401 RESOLVED NPE when parsing scm git revision date on PR branches
  • JENKINS-54400 OPEN parallel sh step with returnStatus: true causing build failure
  • JENKINS-54399 RESOLVED Configuration page no longer loads
  • JENKINS-54397 FIXED BUT UNRELEASED Microfocus Health Analyzer all checks are executed on Master instead of Slave
  • JENKINS-54396 RESOLVED `Configure System` page doesn't work after upgrading to 2.138.2
  • JENKINS-54394 FIXED BUT UNRELEASED Publish Over SSH plugin jenkins.plugins.publish_over.BapPublisherException: Failed to connect and initialize SSH connection. Message: [Failed to change to remote directory [D:]] Error
  • JENKINS-54393 OPEN Active choices does not work correctly with same name jobs under different folders
  • JENKINS-54392 CLOSED EC2 Plugin Does Not Start Stopped Nodes
  • JENKINS-54390 OPEN Convert To Pipeline 1.0 throws NullPointerException
  • JENKINS-54389 OPEN Containers with ENTRYPOINT is not started correctly
  • JENKINS-54388 FIXED BUT UNRELEASED [Jenkins Plugin] [5.6] When pointing to sepcific tenant in jenkins Open MC wizard sometimes it will show "cannot login"
  • JENKINS-54387 OPEN [Jenkins Plugin 5.6] [Update Job] Sometimes when trying to save the setting from MC wizard to Jenkins page it will failed.
  • JENKINS-54386 OPEN preserveStashes does not work with parameter
  • JENKINS-54382 CLOSED Lightweight Checkout failure to find jenkinsfile when jenkinsfile is in a subfolder
  • JENKINS-54379 OPEN Jenkins gradle java.lang.interrupted exception for Jbehave Automated test
  • JENKINS-54378 RESOLVED Pipeline templates in parallel blocks are interpreted as being "nested"
  • JENKINS-54376 OPEN needs documentation
  • JENKINS-54374 OPEN Jenkins never start on raspberry pi
  • JENKINS-54372 RESOLVED NoStaplerConstructorException on jenkins.plugins.git.MergeWithGitSCMExtension
  • JENKINS-54371 CLOSED Monitoring plugin not pushing slave metrics to InfluxDB
  • JENKINS-54370 OPEN false positive SCM triggers
  • JENKINS-54369 OPEN Env-inject writing \u0000 in injectedEnvVars.txt from windows slave
  • JENKINS-54367 OPEN Cannot Rollback/Downgrade jenkins to a previous version after upgrading to a higher version
  • JENKINS-54366 REOPENED Ansible tower 3.3 with plugins 0.9 have issue in workflow extra variables passing
  • JENKINS-54365 OPEN Branch and commit fields are empty in BlueOcean UI Header-details element
  • JENKINS-54364 OPEN Item specific security does not work in my case
  • JENKINS-54363 OPEN ERROR: Could not send email as a part of the post-build publishers.
  • JENKINS-54362 RESOLVED java.lang.RuntimeException: Failed to serialize hudson.model.Actionable#actions for class hudson.matrix.MatrixBuild
  • JENKINS-54360 OPEN octane configuration - the jenkins user field description is not clear
  • JENKINS-54358 RESOLVED AWS flavor got broken by a wrong update
  • JENKINS-54357 OPEN withCredentials + file does not work with the same credentialsId across stages
  • JENKINS-54355 OPEN ClassNotFound: java.sql.Date in JDK 11 in Pipeline Utility Steps
  • JENKINS-54354 RESOLVED Jenkins Window slave can not fetch from bitbucket
  • JENKINS-54349 OPEN Logs are not correctly shown when parallel stage are skipped by when directive
  • JENKINS-54347 CLOSED SchemaDVFactoryImpl NoClassDefFoundError with xUnit 2.3.1
  • JENKINS-54346 OPEN tee keeps file open
  • JENKINS-54341 RESOLVED Ansible Tower Plugin 0.9.0 not compatible with Tower 3.2.5
  • JENKINS-54340 RESOLVED CWP throws error if pom.xml is used for plugins and casc for configuration
  • JENKINS-54339 OPEN Jenkins Configuration Page Loading Forever
  • JENKINS-54338 FIXED BUT UNRELEASED Затирается значение в поле ввода
  • JENKINS-54335 OPEN Upstream Downstream Column plugin displays wrong data
  • JENKINS-54334 OPEN git-plugin ignores 'gitTool' when multiple git tools are configured on the master
  • JENKINS-54333 OPEN Projects are triggered twice by "build with parameters"
  • JENKINS-54331 CLOSED Bitbucket Minimum Successful Merge Check does not work from Bitbucket Branch Source version 2.2.13
  • JENKINS-54330 OPEN While updating jenkins from 2.3 gets OOPS A problem occurred while processing the request.
  • JENKINS-54329 OPEN Jenkins Does Not Use Private IP Address by Default For VPC+PublicIP Slaves
  • JENKINS-54328 OPEN When using blueocean-pipeline editor with when conditions in JenkinsFile we get errors about "Empty closure" and "Expected When Condition"
  • JENKINS-54326 OPEN JUnit fails on remote node after upgrading to 1.26.1
  • JENKINS-54319 OPEN java.lang.ArrayIndexOutOfBoundsException: 0 failed to render Test Results Graph
  • JENKINS-54318 RESOLVED Jenkins Upgrade Now deletes new .war at restart
  • JENKINS-54315 CLOSED Instances sometimes stay disconnected
  • JENKINS-54314 RESOLVED LR 5.6 jenkins features break backwards compatibility
  • JENKINS-54313 OPEN null pointer com.cloudbees.jenkins.plugins.kubernetes_credentials_provider.SecretUtils.getKeyName(SecretUtils.java:186)
  • JENKINS-54312 RESOLVED Change LR Script Report to LR VuGen Report
  • JENKINS-54311 OPEN Create user with . in name doesn't work
  • JENKINS-54310 RESOLVED java.io.IOException: Stream is closed when the CLI has not read entirely the input
  • JENKINS-54309 OPEN Plugin builds Pull Requests on Jenkins Master, ignores Jenkins Workers
  • JENKINS-54308 RESOLVED Change "I" in "Average Transaction Response Time" to lowercase in Performance Project Report
  • JENKINS-54307 OPEN Plot plugin is not working for zero values on logaritmic scale
  • JENKINS-54306 RESOLVED Move Chart Context Menu icon up in LoadRunner Performance Result/Transaction Summary reports
  • JENKINS-54305 OPEN Oracle JDK 10 not available anymore - Oracle JDK 11 is not free
  • JENKINS-54304 IN REVIEW Jobs in parallel dont display the variant they are running.
  • JENKINS-54302 CLOSED silently close octane log (SDK managed)
  • JENKINS-54301 CLOSED silently close uft dispatcher queue on Jenkins shutdown
  • JENKINS-54300 CLOSED silently close uft dispatcher queue on Jenkins shutdown
  • JENKINS-54299 CLOSED Jenkins failed to start after updating pluins and restart
  • JENKINS-54298 OPEN Jenkins crashes with Deadlock with EC2 Plugin
  • JENKINS-54296 OPEN Docker cannot be used right after agent provisioning without sudo
  • JENKINS-54295 IN REVIEW Firefox version in newer jenkins/ath docker image is not compatible with ATH selenium
  • JENKINS-54294 OPEN fix status request in octane multi configuration
  • JENKINS-54286 CLOSED Unable to use variable tokens as build property values in Create Package in Declarative Script
  • JENKINS-54285 OPEN Changeset not reflective of Pull Request
  • JENKINS-54283 OPEN BuildFailureAnalyzer- donotscan=false not working if plugin is installed but not enabled to scan the build
  • JENKINS-54282 OPEN Jenkins stuck on 'Please wait while Jenkins is getting ready to work' after pressing 'Reload Configuration from Disk'
  • JENKINS-54281 OPEN Test Result Trend is broken
  • JENKINS-54278 OPEN Pipeline builds fail when cleanWs() in post stage
  • JENKINS-54277 OPEN StackOverflowError: Excessively nested closures/functions
  • JENKINS-54275 RESOLVED (Google Apps/SAML) org.pac4j.saml.exceptions.SAMLException: Authentication issue instant is too old
  • JENKINS-54274 OPEN issues with test report results
  • JENKINS-54273 IN REVIEW RAW HTML is shown in maven deployment links since 2.138.2
  • JENKINS-54272 OPEN Bibucket Plugin is not triggering the job because of minimal url mismatch (".*/scm/.*")
  • JENKINS-54270 OPEN Clicking graph on JUnit History defaults to port 8080
  • JENKINS-54263 RESOLVED Fix/make sure the AWS flavor still works
  • JENKINS-54262 OPEN Groovy Postbuild requires Overall/Administer permission
  • JENKINS-54261 OPEN Submit ( go ) on Email Template Testing produces blank screen
  • JENKINS-54260 OPEN Fails when notifying for merged PR build
  • JENKINS-54259 OPEN "Missing End Delimiter" when creating the first admin account
  • JENKINS-54258 OPEN Build stops Jenkins server and build.xml is missing
  • JENKINS-54257 RESOLVED Infinite loop when an exception occurs on slave
  • JENKINS-54256 OPEN Pipeline stages can be nested indefinitely
  • JENKINS-54255 CLOSED xUnit sets build status incorrectly
  • JENKINS-54254 OPEN Can't use credentials provided by "Folder Credentials" provider
  • JENKINS-54253 CLOSED fix SSC (Fortify) integration
  • JENKINS-54252 CLOSED unstash very slow blocked on SecureRandom
  • JENKINS-54251 CLOSED RunResults throws NullPointerException
  • JENKINS-54249 OPEN GitHub Commit Status Setter - Cannot retrieve Git metadata
  • JENKINS-54248 OPEN readJSON exposes text data, which could contain secured things
  • JENKINS-54246 OPEN publishCppcheck in pipeline fails job not stage
  • JENKINS-54244 OPEN Calling a function through a pointer with null parameter fails
  • JENKINS-54243 CLOSED Wipeout logging to slave doesn't work
  • JENKINS-54242 OPEN Redundant runs using Poll SCM (No changes)
  • JENKINS-54241 CLOSED Log parser not displaying full log
  • JENKINS-54240 OPEN buildDescription column not available for jobDSL
  • JENKINS-54238 OPEN Issue in created merged Result.html file
  • JENKINS-54236 OPEN Jenkins doesn't send SIGTERM to job
  • JENKINS-54235 REOPENED Parameterized scheduler not triggering daily builds
  • JENKINS-54234 OPEN p4 sync sometimes produces no file, or empty file, when readFile is used immediately after
  • JENKINS-54233 OPEN Pipeline Script textarea missing
  • JENKINS-54232 OPEN Jenkins worker unable to start SPOT instance.
  • JENKINS-54230 OPEN ArrayList join produces join of only first item
  • JENKINS-54229 OPEN Vsphere plugin job fails after snapshot
  • JENKINS-54228 RESOLVED xunit fails to validate XML surefire report of Maven Surefire Plugin since version 2.22.1
  • JENKINS-54226 OPEN Script not approved for use exception at the end of every build log - even for jobs with no groovy scripts
  • JENKINS-54225 OPEN Using disableDeferredWipeout within pipeline job results in no deleted workspace
  • JENKINS-54224 IN REVIEW Rework all json construction
  • JENKINS-54223 RESOLVED Job configurations displayed incorrectly (raw)
  • JENKINS-54222 CLOSED p4-plugin keeps opening connection during the build. Causing long delays
  • JENKINS-54219 OPEN rich-text-publisher-plugin rendering broken with 2.146
  • JENKINS-54218 OPEN Job DSL API in groovy for Office 365 Connector
  • JENKINS-54217 CLOSED Simple wipeout doesn't work correctly when an issue occurred during launch an agent
  • JENKINS-54216 OPEN NPE when calculating culprits
  • JENKINS-54215 OPEN NullPointerException when the build result is null
  • JENKINS-54213 OPEN MAC OS linked clone
  • JENKINS-54209 OPEN Can't read file: Can't access the file
  • JENKINS-54206 RESOLVED Merged PRs not being removed from multibranch
  • JENKINS-54205 OPEN Blue Ocean Editor modifies a declarative Jenkinsfile without warning
  • JENKINS-54203 OPEN Localized Login button: wrong encoding, shows : Iniciar sesión
  • JENKINS-54202 OPEN Too much output from SH executor causes the agent to freeze
  • JENKINS-54200 OPEN 我需要在我的平台上集成jinkens 然后创建job的时候有问题
  • JENKINS-54199 OPEN Error loading Blue Ocean for Project
  • JENKINS-54198 OPEN Results are overriden with parallel builds
  • JENKINS-54196 OPEN Regression: jnidispatch (/com/sun/jna/linux-ppc64/libjnidispatch.so) not found in resource path
  • JENKINS-54190 RESOLVED All of the parallel stages with a regression post trigger will trigger if one of the stages fail.
  • JENKINS-54189 IN REVIEW several minor issues
  • JENKINS-54187 OPEN EC2 Plugin deadlock leaving Jenkins unresponsive
  • JENKINS-54186 IN PROGRESS No @DataBoundConstructor on any constructor of class jenkins.plugins.git.GitSCMSourceDefaults
  • JENKINS-54184 CLOSED manager.removeSummaries() throws UnsupportedOperationException
  • JENKINS-54181 RESOLVED Performance Plugin - Performance report displayed incorrect when compare Reports with Build number
  • JENKINS-54180 CLOSED Git ssh error
  • JENKINS-54179 OPEN Test result does not include tests that failed in BeforeClass
  • JENKINS-54178 OPEN Jenkins loses build history
  • JENKINS-54177 OPEN Multibranch Pipeline and MercurialSCM and Windows node and subrepos
  • JENKINS-54176 OPEN CLI AuthenticationCache is not working with -remoting + @CLIMethod
  • JENKINS-54173 RESOLVED Upgrade commons-compress in plugin/pom.xml to 1.18
  • JENKINS-54172 OPEN Unhelpful NPEs are being logged
  • JENKINS-54170 OPEN Kubernetes agent does not connect on first several attempts
  • JENKINS-54169 OPEN Download of newer version does not use proxy configuration
  • JENKINS-54168 OPEN Jacoco: "RuntimeException: While reading class directory"
  • JENKINS-54167 RESOLVED Hide Evergreen Jenkins plugin for non-evergreen installs
  • JENKINS-54166 FIXED BUT UNRELEASED Date parameter is lost upon restart
  • JENKINS-54165 OPEN nexusPublisher throws exceptions "Bad Request Error" after upgrade
  • JENKINS-54162 CLOSED Cannot delete pod that doesn't start properly
  • JENKINS-54161 OPEN remote job being triggered twice
  • JENKINS-54160 REOPENED Script Security: org.jenkinsci.plugins.scriptsecurity.sandbox.RejectedAccessException: Scripts not permitted to use staticMethod Globals getNumber_of_quarantaene
  • JENKINS-54157 OPEN Unstable builds are marked as FAILED in Bitbucket
  • JENKINS-54156 OPEN Fails to run when non "Default" version is used
  • JENKINS-54155 OPEN Jobs using docker agents disrupt each other if triggered simultaneously
  • JENKINS-54148 OPEN Failure in case node name contains space: Illegal char <">
  • JENKINS-54147 OPEN SSH protocol not supported
  • JENKINS-54146 RESOLVED Job History Plugin 2.18.2 - XML view not working
  • JENKINS-54144 RESOLVED Job fails as JiraSCMListsener/JiraSite potentially creating Executor with 0 threads
  • JENKINS-54143 OPEN Cannot create new users in 2.138.2
  • JENKINS-54142 RESOLVED Refusing to marshal jenkins.plugins.publish_over.BPInstanceConfig for security reasons
  • JENKINS-54141 OPEN After downgrading a plugin the status page doesn't indicate "Pending restart"
  • JENKINS-54140 OPEN Unable to archive report when run UFT test from file system
  • JENKINS-54139 CLOSED Jacoco report rendering problem in multi module projects
  • JENKINS-54135 CLOSED Thread unsafe behavior in UserLanguages telemetry
  • JENKINS-54134 OPEN OAuth / OpenID Connect support for Jenkins API
  • JENKINS-54133 RESOLVED No ANSI coloring on slave agents in pipeline
  • JENKINS-54131 CLOSED "Failed to parse changelog" in JIRA plugin 3.0.3
  • JENKINS-54130 RESOLVED Fix Kafka agent docker build
  • JENKINS-54128 REOPENED Deprecated calls to Run.getLogFile
  • JENKINS-54126 OPEN Jenkinsfile not found in PR on GitHub
  • JENKINS-54124 OPEN Raw HTML when Stapler Security Hardening enabled
  • JENKINS-54123 OPEN NPE when loading jenkins home page
  • JENKINS-54121 RESOLVED Renaming jobs casue Jenkins crash
  • JENKINS-54120 FIXED BUT UNRELEASED Output directory or source file null.
  • JENKINS-54119 OPEN ESlint rules are not applied on the client
  • JENKINS-54117 CLOSED [Jenkins Plugin] [5.5.2] Cannot stop executing the job on Jenkins side (Already checked UFT log no stop replay send to MC)
  • JENKINS-54116 OPEN Jenkins Jira Plugin - Unable to add version
  • JENKINS-54115 IN PROGRESS Remote Invocation of Jenkins API when using Azure AD Plugin
  • JENKINS-54114 OPEN Why am I getting an error as couldn't find ssh agent even though the ssh agent is ruining in Jenkins?
  • JENKINS-54113 RESOLVED NullPointerException in XcodeProjectParser.listXcodeSchemes
  • JENKINS-54112 OPEN Jenkins fails to restart after EC2 plugin upgrade
  • JENKINS-54111 CLOSED disableDeferredWipeout error with workspace cleanup plugin 0.35
  • JENKINS-54110 OPEN Pipeline's dir() does not work with symlinks
  • JENKINS-54109 OPEN safeRestart is not safe when pipelines are run on ephemeral slaves
  • JENKINS-54108 OPEN "JIRA: Progress issues by workflow action" fails when job is located within a folder
  • JENKINS-54107 OPEN raw HTML output when Stapler Security Hardening enabled
  • JENKINS-54106 OPEN Long delay from github webhook to polling when polling threads all busy
  • JENKINS-54105 CLOSED Maven Event Spy InterruptedException
  • JENKINS-54104 OPEN Blueocean cannot display 10 downstream jobs
  • JENKINS-54103 OPEN Gather feedback from people with Jenkins support experience to validate the rollback/crashes scenarios
  • JENKINS-54102 OPEN Endless builds with local branch checked out
  • JENKINS-54101 OPEN kubernetes for multibranchPipelineJob (save folder first)
  • JENKINS-54099 IN REVIEW Warnings about "Failed Jenkins SSE Gateway configuration request. Unknown SSE event dispatcher" in Evergreen
  • JENKINS-54098 OPEN github webhook not working with dynamic feature branch
  • JENKINS-54097 OPEN git config --get submodule fails with GIT_SSH credentials
  • JENKINS-54096 OPEN The option of 'Use Gitlab repository permissions' is useless for Multi Branch Pipeline Jobs
  • JENKINS-54095 OPEN Extra character in output when running inside a container
  • JENKINS-54094 REOPENED Multiple octane tests are failing
  • JENKINS-54093 RESOLVED Jenkins Jira Plugin sets connection timeout to default = 10 after Jenkins restart
  • JENKINS-54092 CLOSED Same user defined global step run in parallel stages gets passed incorrect variables
  • JENKINS-54091 OPEN Messages with ampersands are HTML escaped
  • JENKINS-54090 IN REVIEW EC2 Plugin instance cap is enforeced by AMI ID, not by per-slave template
  • JENKINS-54083 CLOSED How do you run a jenkins master container on windows?
  • JENKINS-54081 IN REVIEW Timestamps missing for agent-based steps in Pipeline Job 2.26
  • JENKINS-54080 OPEN build-user-vars-plugin fails to find correct userId with build pipeline plugin
  • JENKINS-54079 OPEN Pipeline variables not updated in agent delcaration
  • JENKINS-54078 RESOLVED [JEP-210] Exception: Object was recently deallocated when using Git + timeout(activity: true)
  • JENKINS-54077 RESOLVED Multiple workspaces created for same job.
  • JENKINS-54076 CLOSED Polling keeps building without changes on error
  • JENKINS-54075 OPEN Polling Log Javascript Error: "toggle is not defined"
  • JENKINS-54074 OPEN Blue Ocean is missing stages.
  • JENKINS-54073 RESOLVED "Pipeline: Job" plugin causes Jenkins Master CPU to peg to ~100% during pipelines with parallel steps
  • JENKINS-54071 CLOSED EC2-plugin not spooling up stopped nodes
  • JENKINS-54069 RESOLVED test
  • JENKINS-54068 RESOLVED creating properties files for managing strings used in PC classes for logs reports
  • JENKINS-54067 RESOLVED workspace variable is null in pipeline as the perform with abstract build is not invoked (setting it in perform with Run build)
  • JENKINS-54066 RESOLVED preventing possibility for an endless build when trend report creation cannot be started in PC (adding a second counter + timer for that effect)
  • JENKINS-54065 RESOLVED updating differences between model and builder to prevent pipeline failure
  • JENKINS-54064 OPEN Gradle plugin uses legacy plugin format
  • JENKINS-54063 OPEN Windows slave cant be started
  • JENKINS-54062 REOPENED Does not list branches when used as a parameter in pipeline script
  • JENKINS-54061 RESOLVED org.apache.commons.jelly.impl.TagScript.handleException
  • JENKINS-54058 CLOSED Old agent.jar causes JNLP agent to fail checkout with java.lang.IllegalAccessError
  • JENKINS-54055 OPEN MSDeploy ERROR_SITE_DOES_NOT_EXIST does not fail job
  • JENKINS-54054 OPEN Job URL passed to webhook is incorrect (null base url) for manually triggered builds without SCM

Task

  • JENKINS-55095 OPEN There are users who are still using a legacy API token
  • JENKINS-55077 OPEN Add DataBoundSetter to tool and tools
  • JENKINS-55061 OPEN Use GeneralNonBlockingStepExecution in RealtimeJUnitStep.Callback
  • JENKINS-55060 OPEN Use GeneralNonBlockingStepExecution in DockerNodeStepExecution
  • JENKINS-55046 IN PROGRESS Some Windows VMs and agents are not cleaned - "Unknown Network Allocation Error"
  • JENKINS-54991 IN REVIEW Verify Log4j Audit 1.0.1-rc1 works with plugin
  • JENKINS-54966 OPEN Create project wiki page
  • JENKINS-54965 IN PROGRESS Create unit tests for code implementations
  • JENKINS-54957 OPEN Investigate Impact of java.sql modularization on classic Jenkins modes
  • JENKINS-54951 OPEN Update Project README documentation
  • JENKINS-54950 IN REVIEW offer default implementation for Descriptor#configure to use declarative data-binding
  • JENKINS-54946 RESOLVED Jenkins Warning Plugin 4.68 Pylint 1.9 Python 2.7 Reports and Graphs are Basic/Dated - How to Configure for new style
  • JENKINS-54942 OPEN Source details inference failes on Java 11
  • JENKINS-54937 OPEN java.lang.IllegalStateException: Cannot delete last view
  • JENKINS-54929 OPEN Some final output is missing in Jenkins Pipeline when using the Ansible Plugin
  • JENKINS-54925 OPEN Define basic test cases to automate
  • JENKINS-54918 OPEN Purge machine support in ATH
  • JENKINS-54916 OPEN Collapse trivial tests to meaningful use-cases
  • JENKINS-54915 OPEN Remove no_docker tests now when upstream CI supports docker
  • JENKINS-54885 RESOLVED Azure VM Plugin: 1: The storage account name already exists. Use a different name.
  • JENKINS-54867 OPEN Define IANA Enterprise Number field as customizable
  • JENKINS-54851 OPEN Parallel Integration Testing
  • JENKINS-54758 RESOLVED Plugin Manager is available on AWS flavor
  • JENKINS-54755 RESOLVED Disable "Require branches to be up to date before merging" on Evergreen repo
  • JENKINS-54694 OPEN PTC integrity plugin throw error for project not registered in the current server
  • JENKINS-54668 REOPENED Unable to provide NodeJS path to Jenkins plugin
  • JENKINS-54664 RESOLVED Error while trying to update completion status in TFS/Team Services
  • JENKINS-54658 FIXED BUT UNRELEASED Add Jenkins build for audit log plugin
  • JENKINS-54637 OPEN Create a servlet filter to prepopulate audit log attributes
  • JENKINS-54636 FIXED BUT UNRELEASED Configure default audit logging output configuration
  • JENKINS-54624 OPEN ServiceNow Pluging not working
  • JENKINS-54620 OPEN remove maven2 support
  • JENKINS-54614 OPEN whitelist or blacklist the method java.util.List subList int int
  • JENKINS-54601 RESOLVED Include some changes from 1.9.40
  • JENKINS-54598 RESOLVED Explore JDK11 Upgrade for Evergreen
  • JENKINS-54554 IN PROGRESS Jenkins CLI is not working in reverse proxy (traefik)
  • JENKINS-54553 CLOSED Jenkins to disable editing security from UI (even for admins)
  • JENKINS-54552 RESOLVED code analyzer tool exe to analyze the code and generate the excel file
  • JENKINS-54542 OPEN allow the `agent` block to be ignored
  • JENKINS-54533 OPEN Polling is not working with Poll mail box trigger plugin even it is finding the mail
  • JENKINS-54530 OPEN Upgrade mavenMinimalVersion from 3.1.0 to at least 3.5.0 (later is better)
  • JENKINS-54470 FIXED BUT UNRELEASED Configure Log4j Audit Maven plugin for audit log code generation
  • JENKINS-54453 OPEN Allow a user to validate the compatibility of the installed plugins
  • JENKINS-54452 OPEN Allow a user to install their own set of plugins
  • JENKINS-54451 CLOSED Jenkins Set a banner message
  • JENKINS-54449 OPEN Provide a Docker image based on alpine Linux
  • JENKINS-54444 OPEN Update supported Jenkins version
  • JENKINS-54435 OPEN Add tests to HealthAnalyzerCommon
  • JENKINS-54427 OPEN support other containers
  • JENKINS-54420 OPEN Check each plugin included in Evergreen is supported/supportable
  • JENKINS-54419 RESOLVED Re-release 3.13
  • JENKINS-54412 OPEN Testng Plugin should have capability to save the reports in
  • JENKINS-54398 FIXED BUT UNRELEASED Report encoding error if fingerprinter fails to read a source code
  • JENKINS-54391 OPEN Create a minimum framework for testing Jenkinsfile Runner
  • JENKINS-54385 OPEN Octane changes for the next beta
  • JENKINS-54377 OPEN Document CWP usage in Docker
  • JENKINS-54375 OPEN Setup a release flow for Jenkinsfile Runner
  • JENKINS-54348 OPEN Execute load runner script from Jenkins and write the results in qTest
  • JENKINS-54345 OPEN Job-DSL RTC Build Definition
  • JENKINS-54343 RESOLVED Create Jenkinsfile for Jenkinsfile Runner
  • JENKINS-54321 RESOLVED Enable incrementals for audit-log-plugin
  • JENKINS-54320 RESOLVED Move audit log plugin to jenkinsci organization
  • JENKINS-54293 OPEN Automatically run AWS flavor tests in CI
  • JENKINS-54292 RESOLVED Align/fix the codebase to use flavor everywhere instead of environment
  • JENKINS-54291 OPEN Update mentor GSoC guidelines
  • JENKINS-54290 OPEN Use a Jira label to identify GSoC candidate issues
  • JENKINS-54289 RESOLVED Create year-round GSoC schedule
  • JENKINS-54288 RESOLVED Create GSoC project proposal documents
  • JENKINS-54271 IN REVIEW ZPoolExpandNotice is missing its name
  • JENKINS-54269 RESOLVED MissingVerificationStrategyAdministrativeMonitor is missing its name
  • JENKINS-54268 RESOLVED Incrementalify Blue Ocean
  • JENKINS-54267 RESOLVED TlsConfigurationAdministrativeMonitor is missing its name
  • JENKINS-54266 RESOLVED fails to start agent because of missing label
  • JENKINS-54210 CLOSED Jenkins integration with load runner
  • JENKINS-54207 OPEN Update delete plugin flow to error out for anything other than file not found
  • JENKINS-54204 CLOSED Building / Checking evergreen modifies the npm dependencies
  • JENKINS-54185 OPEN HIDE SIDE BAR PERO USER PAGE OR VIEW
  • JENKINS-54175 OPEN Job and auto-PR running npm audit fix
  • JENKINS-54174 OPEN Automate backend update PR
  • JENKINS-54138 OPEN Submit a JEP for audit logging
  • JENKINS-54132 IN PROGRESS Get JEP-8 (GSoC buget) approved
  • JENKINS-54118 CLOSED UFT jobs should be grouped together
  • JENKINS-54100 CLOSED Need plugin that has incompatible format from one version to the next to test evergreen snapshot restore
  • JENKINS-54089 IN PROGRESS Create an audit log destination global configuration
  • JENKINS-54088 IN PROGRESS Log audit events for user creation
  • JENKINS-54087 FIXED BUT UNRELEASED Log an audit event for user login/logout actions
  • JENKINS-54086 RESOLVED Define audit events for user auth-related events
  • JENKINS-54085 RESOLVED Define common audit attributes
  • JENKINS-54084 FIXED BUT UNRELEASED Create audit catalog repository

Story

Patch

  • JENKINS-54535 OPEN Expose build parameters in RunWrapper
  • JENKINS-54532 OPEN Document how to get parameters from a Run
  • JENKINS-54531 RESOLVED Document that buildVariables is the child environment, not parameters
  • JENKINS-54514 OPEN Document parallel step failure logic
  • JENKINS-54361 OPEN Plugin name doesn't match UI, docs stale
  • JENKINS-54280 IN PROGRESS Kubernetes CI/CD only works with github.com