Due to some maintenance issues, this service has been switched in read-only mode, you can find more information about the why

and how to migrate your plugin documentation in this blogpost

Skip to end of metadata
Go to start of metadata
날짜2018 년 7 월 16 일
문제점52084 호

 

개요

 

 

이 릴리스의 중요한 주요 내용

 

이 릴리스의 모든 업데이트

서사시

새로운 기능

  • JENKINS-52574 OPEN Git 작업에 대한 작성자 및 커밋 ID 제공
  • JENKINS-52568 OPEN GetDevStatus 단계 추가
  • JENKINS-52561 OPEN 캐시 플러시 기능 필요
  • JENKINS-52535 CLOSED RunFromFileSystem 빌드를위한 ParallelRunner 지원
  • JENKINS-52516 OPEN 스크립트 이름에 기본 확장명을 추가하지 마십시오.
  • JENKINS-52490 OPEN 플러그인은 환경 변수로 GIT_COMMIT_MESSAGE를 제공해야합니다.
  • JENKINS-52484 RESOLVED 에이전트 Dock 을 Docker 이미지로 패키징하고 DockerHub에 게시합니다.
  • JENKINS-52483 OPEN remoting-kafka-plugin 릴리스 1.0 버전
  • JENKINS-52456 OPEN Jenkins를 사용하여 성능 센터 시나리오를 트리거 할 때의 동적 AWS LG
  • JENKINS-52453 Webhook CLOSED 지원 구현
  • JENKINS-52437 OPEN 지원 Windows 컴퓨팅 인스턴스
  • JENKINS-52430 OPEN REST API를 통해 슬레이브를 마스터에 연결
  • JENKINS-52399 CLOSED 섹션 뷰에 새 폴더 목록 섹션 추가
  • JENKINS-52398 OPEN 모니터 노드 프로비저닝 기간
  • JENKINS-52394 CLOSED api / json? depth = 2 - 지속 시간을 사용할 수 없습니다.
  • JENKINS-52392 IN PROGRESS 정확한 스키마를 존중하지 않는 사용자 정의 junit 형식을 지원합니다.
  • JENKINS-52391 OPEN 평행 스테이지 재시동
  • JENKINS-52387 OPEN 실패한 테스트를 Jira 문제와 자동으로 연결하는 기능.
  • JENKINS-52360 CLOSED 은 워크 플로우 종류의 파이프 라인에 SVN SCM 지원 추가
  • JENKINS-52332 RESOLVED 노드 API 재시작 지원 (재시작 가능 플래그 및 재시작 명령)
  • JENKINS-52320 OPEN 보안 설정이 아닌 플러그인 선택 마법사 만 건너 뛸 수 있어야합니다.
  • JENKINS-52311 OPEN Ownership Plugin에서 JCasC 지원
  • JENKINS-52259 RESOLVED 외부 파일에서 창 템플릿 yaml 읽기
  • JENKINS-52251 OPEN GCE 기능 '배포 컨테이너'지원
  • JENKINS-52245 OPEN 빌드 완료 직후 VM 인스턴스 제거 가능성 (1build : 1vm 규칙)
  • JENKINS-52236 OPEN 파서를 선택한 후 일부 매개 변수를 구성 할 수 있습니다.
  • JENKINS-52233 OPEN 보류중인 이름 바꾸기 및 삭제 요청에 시각적 / 전자 메일 알림 추가
  • JENKINS-52226 OPEN Github 페이지의 문서
  • JENKINS-52213 OPEN admin 인터페이스를 통해 사용자를 추가 할 수없는 경우 누락 된 오류 메시지가 표시됨
  • JENKINS-52203 OPEN 작업 실행을 차단할 수있는 '선행 조건'섹션 (예 : 트리거) 제공
  • JENKINS-52169 OPEN 원타임 포스 동기화
  • JENKINS-52158 OPEN 조건부 병렬 패스트 패스트
  • JENKINS-52141 RESOLVED 대기중인 항목 메트릭을 원하는 플러그인에 노출 시키십시오.
  • JENKINS-52098 OPEN 참조 빌드의 총 경고 임계 값입니다.
  • JENKINS-52088 OPEN Perforce Buildfarm 서버 지원
  • JENKINS-52075 RESOLVED 파이프 라인 작업의 누적 실행 시간 추적
  • JENKINS-52061 RESOLVED 4.0.x로 메트릭 업그레이드
  • JENKINS-52048 OPEN 래퍼 로그에 임의의 태그 추가
  • JENKINS-52025 OPEN 파이프 라인 시각화 플러그인에서 순차적 인 선언적 파이프 라인 단계를 편집 할 수 있습니다.
  • JENKINS-52022 RESOLVED 우리는 선언적 Jenkinsfile (우리 소스 코드의 일부가 될 것임)에서 메소드를 정의하고 그것을 공유 라이브러리에서 호출 할 수 있습니까?
  • JENKINS-52003 OPEN 설명자 확장
  • JENKINS-52000 간행물 OPEN 및 데이터 개인 정보 보호 텍스트를 추가하는 옵션
  • JENKINS-51989 OPEN 기존보기 내에 작업 작성
  • JENKINS-51965 IN REVIEW WAR Exploder에서 Java 9+ 용 JAXB 패키징 지원 추가
  • JENKINS-51953 OPEN 방아쇠를 유발 한 Maven 아티팩트의 세부적인 업스트림 원인으로 인해 파이프 라인이 개선되었습니다.
  • JENKINS-51929 OPEN YAML 및 BOM 정의에 해당하는 "mvn incrementals : update"를 만듭니다.
  • JENKINS-51924 OPEN Java가 아닌 언어 용 변환기 지원
  • JENKINS-51918 OPEN 이전 / 이후 버전을 무시한 분기 구축 전략
  • JENKINS-51898 CLOSED 젠킨스 blueocean docker 이미지에 고정 표시가 없습니다.
  • JENKINS-51897 OPEN PR이 닫힐 때 작업 공간을 h 제합니다.
  • JENKINS-51856 OPEN EXTENSIONS_AUGMENTED와 JOBS_LOADED 사이에 새로운 이정표 소개
  • JENKINS-51841 RESOLVED 원격 확장 성 : 원격 CommandTransport 구현에 명령을 작성하기위한 API 제공
  • JENKINS-51814 RESOLVED 보고서 탐지기 확장 점 작성
  • JENKINS-51807 RESOLVED Docker에서 Jenkins 용 Java 11 패키지 만들기
  • JENKINS-51806 RESOLVED Docker에서 Jenkins 용 Java 10 패키지 만들기
  • JENKINS-51804 REOPENED 공유 라이브러리에 대한 스 니펫 생성기 항목 만들기
  • JENKINS-51803 OPEN jenkins API로 작업 상태 찾기 (활성 / 비활성)
  • JENKINS-51783 CLOSED YAML에서 git push [to target] 단계의 지원 추가
  • JENKINS-51782 CLOSED findbugs () 단계의 지원 추가
  • JENKINS-51742 OPEN JobDelete Builder Plugin - 폴더 플러그인 지원 추가
  • JENKINS-51738 OPEN 맞춤 게시자가 UI를 확장하도록 허용
  • JENKINS-51736 OPEN llvm-cov 보고서 변환기 지원 추가
  • JENKINS-51721 OPEN 임의의 빌드에서 "태그 없음"아이콘을 클릭하고 새 태그를 만들 때 원본 태그를 밀어 넣습니다.
  • JENKINS-51711 IN PROGRESS Remoting Kafka를위한 바로 사용 가능한 데모
  • JENKINS-51710 RESOLVED 프리젠 테이션을위한 Remoting Kafka 데모 만들기
  • JENKINS-51709 OPEN 카프카 채널에 대한 청킹 기능 확인
  • JENKINS-51708 RESOLVED 명령 호출을위한 명령 전송 구현 (에이전트 용)
  • JENKINS-51705 OPEN 지원 org.jenkins-ci : trilead-ssh2 with curve25519-sha256@libssh.org 교환 방법
  • JENKINS-51675 CLOSED SpotBugs 보고서 지원
  • JENKINS-51672 OPEN 빌드하는 동안 사용자의 역할을 얻을 수있는 기능
  • JENKINS-51668 OPEN 파이프 라인 및 스테이지에 설명 블록 추가
  • JENKINS-51666 OPEN ClassFilterImpl에서 거부 된 클래스에 대한 폴란드어 로깅
  • JENKINS-51659 RESOLVED 젠킨스 학부모 POM은 배포 중 자동으로 repo를 다시 작성해야합니다.
  • JENKINS-51658 OPEN 플러그인 POM은 릴리스 이후 자동으로 reincrementalify를 실행해야합니다.
  • JENKINS-51657 OPEN github 조직에 대한 인증 제한
  • JENKINS-51645 IN PROGRESS xUnit에서 클레임 플러그인에 대한 지원 추가
  • JENKINS-51637 RESOLVED SPRP 플러그인 용 단계 구성자 생성
  • JENKINS-51618 OPEN 사용자 항목에 대한 조건부 매개 변수
  • JENKINS-51609 RESOLVED 낮은 coverage 코드 만 표시하도록 보고서 필터링
  • JENKINS-51597 CLOSED 스크립트 보안에서 승인을위한 사용법 참조 추가
  • JENKINS-51593 OPEN Jenkins 파이프 라인 스크립트의 동적 트리거 구성을위한 Gerrit 트리거

개량

  • JENKINS-52578 OPEN 재시도 절이 곱셈을 발생시킵니다.
  • JENKINS-52575 OPEN [Blue Ocean] 하위 스테이지가 error ()로 종료되면 순차 스테이지의 시각화가 빨간색이어야합니다.
  • JENKINS-52567 CLOSED In-process 승인의 화이트리스트 ResponseData 메소드
  • JENKINS-52562 OPEN 작업 평가 요약에 품질 게이트 평가가 표시되지 않습니다.
  • JENKINS-52560 hudson.plugins OPEN 아래의 모든 것을 deprecated로 표시하고 단계를 더 이상 사용하지 않는 것으로 표시하십시오.
  • JENKINS-52559 OPEN 모든 로그 메시지 검토
  • JENKINS-52558 RESOLVED 파일 이름 렌더링 borken
  • JENKINS-52551 OPEN Jenkins PMD 플러그인에 대한 PMD 수준 매핑 구성 가능
  • JENKINS-52550 OPEN 작업 DSL : 스크립트 파일의 로그 경로
  • JENKINS-52547 OPEN Jenkins 자격 증명 저장소에서 privateKey를 선택할 수 있습니다.
  • JENKINS-52545 RESOLVED 요약 집계 가 손상됨
  • JENKINS-52544 OPEN 영향을받는 파일을 분석하는 동안 오류 처리를 정의합니다.
  • JENKINS-52542 OPEN Nice2have : 여러 가지 Kafka 호스트가 내결함성을 제공합니다.
  • JENKINS-52541 OPEN Remoting Kafka Plugin의 연결 논리 설명
  • JENKINS-52534 IN REVIEW java8 시간 클래스를 마스터와 슬레이브간에 보낼 수 없습니다.
  • JENKINS-52533 OPEN 빌드 작업에 커밋 메시지 표시
  • JENKINS-52522 OPEN 작업 흐름 API에 100 개가 넘는 레코드를 표시합니다.
  • JENKINS-52521 OPEN 계층 적 보고서 유형 지원
  • JENKINS-52520 OPEN "when"선언 파이프 라인 지시문을 지원합니다.
  • JENKINS-52519 OPEN 베타 버전 출시
  • JENKINS-52518 OPEN 문서 마무리
  • JENKINS-52517 OPEN 신뢰할 수있는 사용자가 끌어 오기 요청을 승인 했는지 확인하고 그에 따라 빌드를 시작하십시오.
  • JENKINS-52510 OPEN 로그에 쓰레기가 있습니다.
  • JENKINS-52507 IN PROGRESS "Jenkinsfile.yaml"의 도구 섹션이있는 에이전트가 없습니다.
  • JENKINS-52496 OPEN ATH 테스트 만들기
  • JENKINS-52495 OPEN 단위 테스트 추가
  • JENKINS-52492 OPEN 다이어그램이있는 설계 설명 문서.
  • JENKINS-52491 OPEN 스 니펫 생성기를 확장 프로그램에서 분리합니다.
  • JENKINS-52486 RESOLVED 두 번째 알파 릴리스에 대한 CHANGELOG 만들기
  • JENKINS-52477 OPEN XML 파서는 XML 파일에 주어진 인코딩을 사용해야합니다.
  • JENKINS-52469 OPEN coverage.py 범위 보고서 지원 추가
  • JENKINS-52468 OPEN Credential.java의 변수 이름 변경
  • JENKINS-52467 OPEN gcov 형식 지원 추가
  • JENKINS-52463 OPEN 각 SonarQube 파서는 다른 SonarQube 파서의 파일을 건너 뛰어야합니다.
  • JENKINS-52462 OPEN SonarQube Diff 파서는 textRange 속성을 읽어야합니다.
  • JENKINS-52460 옥타브로 IN PROGRESS 로그 푸시 개선, 내부 로깅 및 옥탄 지향적 인 REST
  • JENKINS-52454 OPEN Testlink 통합
  • JENKINS-52446 OPEN 은 findFiles에 기본 디렉토리를 설정할 수 있습니다.
  • JENKINS-52439 OPEN newContainerPerStage가 깨끗한 컨테이너를 제공하지 않습니다.
  • JENKINS-52435 OPEN Jenkins 빌드에서 두 개 이상의 변수를 influxdb 서버로 전달합니다.
  • JENKINS-52425 OPEN CloverPublisher가 사용자가 입력 한 범위 보고서 이름을 사용하도록 허용합니다.
  • JENKINS-52424 OPEN jacoco () 파이프 라인 단계에서 사용자에게 입력 된 범위 보고서 이름을 허용합니다.
  • JENKINS-52423 OPEN 선택도를 향상시켜 개별 노드에서 사용할 수있을뿐만 아니라 행과 열을 선택적으로 만들 수 있으므로 행의 요소를 선택하면 모든 다른 열 조합이 선택적이됩니다.
  • JENKINS-52422 OPEN 이벤트의 진단 로깅을 제거합니다.
  • JENKINS-52421 OPEN PowerShell Core on Nano Server 지원
  • JENKINS-52419 OPEN 블루 오션 테스트 결과에는 지속 시간이 없습니다
  • JENKINS-52417 RESOLVED 베타 API 제거 : FilePath.copyFromRemotely ()
  • JENKINS-52410 OPEN 전역 공유 라이브러리의 전역 변수 문서
  • JENKINS-52409 IN REVIEW 폴더 내에 $ JOB_DIR_NAME 변수를 제공하십시오.
  • JENKINS-52405 OPEN 'failFast'설정에 의해 취소 된 병렬 작업을 취소됨, 실패하지 않음으로 표시하십시오.
  • JENKINS-52396 OPEN 블루 오션과 통합 되었습니까?
  • JENKINS-52393 OPEN 이벤트 기록에 날짜 및 시간 추가
  • JENKINS-52390 CLOSED 코드가 노드 블록에 없을 때 적절한 오류를 던집니다.
  • JENKINS-52388 OPEN 선언을 건너 뛸 수 없습니다. 스테이지에서 다시 시작할 때 SCM을 체크 아웃하십시오.
  • JENKINS-52377 RESOLVED 비어있는 열을 표시하지 마십시오.
  • JENKINS-52348 OPEN Windows 박쥐 단계는 결코 실패하지 않습니다.
  • JENKINS-52347 OPEN 다중 회선 박쥐 단계가 단일 콘솔 세션 내에서 실행되지 않습니다.
  • JENKINS-52342 OPEN 생성 된 버킷에만 액세스 할 수 있도록 S3 보안 정책을 수정하십시오.
  • JENKINS-52339 CLOSED 새 API 토큰 시스템은 서비스 계정에 대해 토큰을 만들 수 있어야합니다.
  • JENKINS-52337 RESOLVED Essentials 에이전트 용 AMI 만들기
  • JENKINS-52336 RESOLVED Jenkins Essentials Master를 실행하기위한 AMI 만들기
  • JENKINS-52331 OPEN Blue Ocean : GitHub 프로젝트의 파이프 라인 편집기에서 파이프 라인을 편집 / 실행하는 기능 추가
  • JENKINS-52330 OPEN Blue Ocean : PowerShell에 대한 지원 추가
  • JENKINS-52329 OPEN NodeJS 플러그인은 Blue Ocean을 지원해야합니다.
  • JENKINS-52328 IN PROGRESS 정보 레벨이 anchoreengine 모드에서 너무 시끄 럽습니다.
  • JENKINS-52324 OPEN Jenkins 테스트 결과를 빌드 용 BitBucket 상태 메시지에 추가합니다.
  • JENKINS-52323 CLOSED 토큰 매크로 지원 추가
  • JENKINS-52321 OPEN 기본 Jenkins % JENKINS_HOME %이 (가) Windows 시스템에서 Windows 시스템과 호환됩니다.
  • JENKINS-52313 OPEN 공유 라이브러리 자원 폴더에 2 진 파일 저장 중
  • JENKINS-52308 OPEN 파일 누출 감지기 및 파일 누출 감지기 플러그인을 ASM 6.2로 업데이트
  • JENKINS-52306 IN PROGRESS SSO 로그 아웃 향상
  • JENKINS-52305 gerrit OPEN -trigger 플러그인에서 " Commend Added Regs Regular Expression"을 사용할 수 없습니다.
  • JENKINS-52304 RESOLVED 코드로 구성을 통해 플러그인을 완벽하게 구성 할 수있게하십시오.
  • JENKINS-52292 OPEN 다중 볼트 ID 지원
  • JENKINS-52291 OPEN 플러그인은 자격 증명 유형을 정의해야합니다. 이 유형은 사전 선택되어야합니다.
  • JENKINS-52290 OPEN Jenkins Parent를 JDK 10 지원이있는 플러그인 버전으로 업데이트
  • JENKINS-52289 OPEN AWS Cloudwatch Logs 플러그인에 파이프 라인 단계 지원 추가
  • JENKINS-52288 CLOSED 여러 단계에서 나온 여러 TestResult 병합 허용
  • JENKINS-52285 OPEN Extras Executable WAR : "--enable-future-java"없이 JDK 10에서 실행 허용
  • JENKINS-52282 OPEN JNLPLauncher : Java Web Start 내장 문서 및 Wiki를 사용하여 Java 10 이상에서 비 가용성을 반영합니다.
  • JENKINS-52281 RESOLVED PipelineNodeTest에서 일부 사용되지 않는 항목 정리
  • JENKINS-52274 OPEN 빌드 페이지의 빌드 아티팩트를 삭제하거나 비활성화 *보기 *
  • JENKINS-52258 OPEN 폴더 수준에 매트릭스 프로젝트 권한 부여
  • JENKINS-52257 OPEN LDAP 플러그인이 그룹 조회를 완전히 비활성화하도록 허용합니다.
  • JENKINS-52255 IN PROGRESS XML을 출력하기 위해 list-plugins CLI 명령에 옵션을 추가하십시오.
  • JENKINS-52244 RESOLVED 알파 릴리스에 대한 README 업데이트
  • JENKINS-52243 RESOLVED remoting-kafka-plugin 용 위키 페이지 만들기
  • JENKINS-52242 RESOLVED Github 저장소에 변경 로그 생성
  • JENKINS-52239 OPEN 그래픽 상태의 작업 상태 페이지에 표시 할 심각도 레벨을 선택할 수 있습니다.
  • JENKINS-52238 젠킨스 OPEN 에서 만든 모든 파서를 하나의 파일로 저장할 수 있습니까?
  • JENKINS-52237 OPEN 은 작업 구성에서 직접 groovy 스크립트로 새 파서를 구성 할 수 있습니다.
  • JENKINS-52235 RESOLVED 는 전자 메일 보고서와 플러그인 경고 사이의 링크를 개선합니다 : 예를 들어 총 경고 / 오류 수를 추가하면 작업에 표시된 것과 같은 이미지가 추가됩니다
  • JENKINS-52225 CLOSED 최신 JSch 버전으로 업그레이드
  • JENKINS-52221 OPEN 매개 변수가있는 트리거 플러그인 매개 변수의 텍스트 영역에서 bash 배열 구문 분석 지원
  • JENKINS-52220 OPEN 끌어 오기 요청 작성을 위해 병합 Commit SHA 사용
  • JENKINS-52212 OPEN 직업 포용 전략 : Regex
  • JENKINS-52205 OPEN JCasC 플러그인의 Locale Plugin 지원 추가
  • JENKINS-52200 RESOLVED Integrate Kafka admin portal
  • JENKINS-52199 OPEN Investigate on consumer pooling, NIO options
  • JENKINS-52190 RESOLVED Update Remoting Kafka to the released versions of Remoting/Core with extensibility API
  • JENKINS-52183 OPEN [API Token] Replace number of days by Today, Yesteday, x weeks ago, etc.
  • JENKINS-52182 OPEN [API Token] Improve the "fresh" / "recent" token column
  • JENKINS-52176 OPEN Allow creation of BuildInfoResultAction with a preexisting publish.properties
  • JENKINS-52175 IN PROGRESS Add a CLI to list credentials using XML output
  • JENKINS-52165 IN REVIEW Use push rather than pull for durable task logging
  • JENKINS-52160 OPEN nodes are launched even when in shutdown mode
  • JENKINS-52138 OPEN Change the BitBucket status message for "In progress" builds
  • JENKINS-52132 IN PROGRESS Description with HTML support
  • JENKINS-52131 RESOLVED Allow setting ignoreAcceptLanguage from Java API
  • JENKINS-52123 IN REVIEW Adjust sse-gateway to the now configurable location for tasks logging
  • JENKINS-52120 OPEN docker-plugin should support windows containers
  • JENKINS-52109 RESOLVED Add IDs to HtmlElements
  • JENKINS-52106 RESOLVED Id for PageObject MessageBox
  • JENKINS-52105 OPEN Add support for Maven 3.5.2
  • JENKINS-52102 CLOSED unable to run pipeline project
  • JENKINS-52097 RESOLVED Plugin POM should support setting custom Animal Sniffer versions
  • JENKINS-52095 OPEN Timeout step should not count job/stage queuing time
  • JENKINS-52094 IN PROGRESS Support of testing Jenkins plugins with Java 10 on CI
  • JENKINS-52093 OPEN Exploratory testing of K8s plugin with Java 10/11
  • JENKINS-52092 RESOLVED Update Monitoring Plugin to Java Melody 1.73.0
  • JENKINS-52090 OPEN Support arm64 architecture build of docker image
  • JENKINS-52079 OPEN Tear down connection when master or agent stops
  • JENKINS-52077 OPEN Separate TFVC and TFS/VSTS integration in two plugins
  • JENKINS-52076 OPEN NPE when the ~/.aws configuration does not exists
  • JENKINS-52070 IN REVIEW remove reflection and support Windows in lib-process-utils for getting PID
  • JENKINS-52068 CLOSED Remove use of reflection in parameterized-scheduler plug-in
  • JENKINS-52064 OPEN Option to mute JDK installation output
  • JENKINS-52062 IN REVIEW Add support to trigger MultiBranchPipeline from RabbitMQ Trigger
  • JENKINS-52058 OPEN Provide report filename as variable to Groovy parser
  • JENKINS-52044 IN REVIEW Remove JNLP agent port from the Remoting Kafka Plugin demo
  • JENKINS-52029 RESOLVED Create a BlueOcean JDK 10 image for evaluation
  • JENKINS-52028 RESOLVED Add support of Incremental releases to Docker plugins.txt
  • JENKINS-52026 RESOLVED Make it possible to monitor executed CLI commands
  • JENKINS-52010 RESOLVED Switch Java 10 and 11 branches to experimental UC by default
  • JENKINS-52009 OPEN Support time zone in cron expression
  • JENKINS-52004 RESOLVED Add java.activation module to Java 10 Docker packages
  • JENKINS-51998 CLOSED Pipeline serialization fails on Java 10: java.lang.NoClassDefFoundError: Could not initialize class org.jboss.marshalling.river.RiverMarshaller
  • JENKINS-51994 RESOLVED Extras Executable WAR: Add link to "Running Jenkins with Java 10+" guidelines when printing errors/warnings
  • JENKINS-51988 RESOLVED Add source code navigation
  • JENKINS-51978 OPEN Change default execution node of pipeline jobs
  • JENKINS-51975 OPEN Automatically show the additional required fields for dynamic/mobile scans
  • JENKINS-51974 FIXED BUT UNRELEASED Allow use of scan files as well as scant files.
  • JENKINS-51973 OPEN "요청 반복 상태 가져 오기"지원
  • JENKINS-51969 OPEN JNLP 실행 프로그램이 초기 연결 시도를 재 시도하는 옵션
  • JENKINS-51967 CLOSED 작업에 대한 새 권한 유형 : 권한 설정
  • JENKINS-51963 RESOLVED 권한 오류에 스택 추적을 표시하지 않습니다.
  • JENKINS-51961 RESOLVED 서브 버전에서 선언 파이프 라인 체크 아웃을 사용할 때 매개 변수를 사용할 수 없습니다.
  • JENKINS-51945 OPEN 단계가 성공했다고해도 실패로 표시 할 수있는 가능성 추가
  • JENKINS-51944 OPEN Remoting Kafka Agent : 번들링 중지 Remoting
  • JENKINS-51941 Webhook OPEN 에서 빌드 지원
  • JENKINS-51936 OPEN 마스터 / 업스트림 커밋에서 트리거가 행복한 건물을 줄입니다.
  • JENKINS-51927 RESOLVED 사용자 친화적 인 구성 페이지 리팩토링
  • JENKINS-51926 OPEN 파이프 라인에서 병렬 () 실행 후 빌드 내에서 보고서를 결합하는 것을 지원합니다.
  • JENKINS-51916 RESOLVED 수동 탭 생성을 제거하십시오.
  • JENKINS-51910 OPEN 비활성화 된 건강 보고서의 이유 표시
  • JENKINS-51896 IN REVIEW PR 변경을 YAML의 대상 분기로 푸시하는 옵션
  • JENKINS-51895 OPEN 일반적인 위치에서 findbugs 보고서를 확인하십시오.
  • JENKINS-51894 OPEN 가능한 경우 UncheckedIOException 사용
  • JENKINS-51893 CLOSED Kubernetes 플러그인의 컨테이너 이름을 검사하는 중 오류가 발생했습니다.
  • JENKINS-51884 OPEN 보안 그룹 필드 기록
  • JENKINS-51880 OPEN 네트워크 중단에 대한 면역 증대
  • JENKINS-51879 OPEN 스캔 리포지토리 트리거 주기적 : 구성 가능 crontab (`spec`)
  • JENKINS-51876 IN PROGRESS 코어 및 Java 버전 업데이트, 더 이상 사용되지 않는 코드 제거
  • JENKINS-51867 RESOLVED 더 나은 방법으로 PR을위한 지사 이름 얻기
  • JENKINS-51857 RESOLVED 디스크에 Kafka 등록 정보 저장 중지
  • JENKINS-51847 RESOLVED 요약에 모든 도구가 표시되지 않습니다.
  • JENKINS-51837 RESOLVED ASM 및 BCT를 ASM 6.2로 업데이트
  • JENKINS-51836 RESOLVED Java 10을 지원하는 버전으로 Extras Executable WAR 및 BCT 업데이트
  • JENKINS-51835 RESOLVED 핵심 저장소에서 평가할 Java10 Dockerfile 만들기
  • JENKINS-51834 RESOLVED "java10"지점의 핵심 CI를 단순화하십시오.
  • JENKINS-51831 RESOLVED Add documentation to Remoting Kafka Global Configuration fields
  • JENKINS-51830 RESOLVED Add "Test Connection" button to Global Kafka configurations
  • JENKINS-51811 OPEN KubernetesSlave should override getWorkspaceFor(TopLevelItem)
  • JENKINS-51808 OPEN Dependent steps in parallel
  • JENKINS-51771 OPEN Use Jenkins proxy configuration
  • JENKINS-51768 OPEN PC12.57/60 - Jenkins PC plugin: Unknown exception (false alarm) during run execution, which terminates the flow, but from PC side - the flow continues without errors
  • JENKINS-51764 OPEN use existing Timeslot in CI build of a test
  • JENKINS-51751 OPEN When claiming Test or build, only send mail if claiming for someone else
  • JENKINS-51749 OPEN Jackson-Databind needs to be upgraded to 2.9.4+ to address CVE-2018-5968
  • JENKINS-51748 OPEN Jackson-Databind needs to be upgraded to 2.9.4+ to address CVE-2018-5968
  • JENKINS-51747 OPEN Jackson-Databind needs to be upgraded to 2.9.4+ to address CVE-2018-5968
  • JENKINS-51737 RESOLVED Move auto-detector coverage publishing logic to the extension point implementation
  • JENKINS-51730 OPEN Configure search maxResults at global level
  • JENKINS-51725 OPEN Locks should be scoped - multi Tennant problem
  • JENKINS-51718 OPEN Add "Generate Declarative Pipeline" option
  • JENKINS-51717 CLOSED Give support for different scan report formats
  • JENKINS-51702 OPEN Summarize history of same test case executed in different parallel splits
  • JENKINS-51699 OPEN Add tags for Robot Framework results
  • JENKINS-51694 OPEN Fix tracking for credentials against cloud agents
  • JENKINS-51693 CLOSED Use a list of connected Google accounts instead of typing email/password
  • JENKINS-51684 OPEN Add read support for gzip compressed XML files
  • JENKINS-51682 OPEN No logging of mavenOpts
  • JENKINS-51667 RESOLVED Missing Jenkins API support for reading fingerprints of pipeline build
  • JENKINS-51648 OPEN support for content-type yaml in pipeline httpRequest
  • JENKINS-51642 RESOLVED XML report does not have details for issues
  • JENKINS-51640 IN PROGRESS Optimization in query used to get current revision info
  • JENKINS-51633 OPEN Calculate Changelog against a specific branch should allow empty remote
  • JENKINS-51632 OPEN Trap exception for invalid credential
  • JENKINS-51619 CLOSED Ability to upload APK to 'internal' track
  • JENKINS-51613 OPEN Allow requesting for all versions on checkout
  • JENKINS-51611 RESOLVED Add several tests
  • JENKINS-51598 RESOLVED Offer a way to retrieve PermissionGroup IDs in API
  • JENKINS-51595 OPEN Use tabs for Jenkins pipeline replay

Bug

  • JENKINS-52591 OPEN Job DSL does not track manual changes correctly
  • JENKINS-52590 OPEN p4-plugin sets client root to null
  • JENKINS-52587 OPEN timeOut에 도달하면 '테스트 결과'가 저장되지 않습니다.
  • JENKINS-52586 OPEN [SRF] 클라이언트의 비밀을 유지하는 대신 Jenkins 자격 증명 사용
  • JENKINS-52585 CLOSED 센터 안정 URL 403 업데이트
  • JENKINS-52584 IN REVIEW aws의 필수 요소 인 잘못된 사용 가능 영역
  • JENKINS-52583 OPEN jenkins 데비안 패키지는 openjdk 패키지에 의존해야합니다.
  • JENKINS-52582 IN PROGRESS AMI에는 batmat ssh 공개 키가 포함되어 있습니다.
  • JENKINS-52579 OPEN hasProperty는 파이프 라인 컨텍스트에서 null을 반환합니다 (예 : 작업 매개 변수).
  • JENKINS-52577 OPEN CHANGE_ 변수가 없습니다.
  • JENKINS-52576 OPEN 도커 이미지에서 수면 / 터치를 사용할 수 없을 때 로그가 넘칩니다.
  • JENKINS-52573 OPEN gitlab에 대한 blueocean을 통해 젠킨스 파일 만들기 실패
  • JENKINS-52572 OPEN 작업 영역 매핑의 로컬 측에서 풀 스톱 ( ".")이있는 폴더가 생략됩니다.
  • JENKINS-52571 OPEN NodeProvisioner의 StandardStrategyImpl은 종종 필요한 것보다 더 많은 노드를 제공합니다.
  • JENKINS-52570 OPEN CloudFormation 템플리트의 SSHLocation 매개 변수가 무시됩니다.
  • JENKINS-52566 CLOSED 이미 설치된 젠킨스 용 사용자 이름과 비밀번호를 재설정 할 수 없습니다.
  • JENKINS-52565 OPEN Jeninsfile에서 opsgenie 플러그인 사용
  • JENKINS-52564 OPEN 플러그인 사용 설명서가 불완전하거나 혼동 될 수 있습니다.
  • JENKINS-52563 OPEN NullPointerExecption을 사용하는 Valgrind 게시자 크래시
  • JENKINS-52555 OPEN 선언적 파이프 라인 기능이 환경 블록에서 정의 된 환경 변수에 액세스 할 수 없습니다.
  • JENKINS-52554 OPEN 태그식이 포함 된 경우 파이프 라인 오류
  • JENKINS-52553 OPEN pullRequest.createStatus 제출되는 포크가 아니라 끌어 오기 요청 포크로 상태를보고합니다.
  • JENKINS-52552 OPEN 매개 변수를 사용할 때 Cloudbees 폴더가 작동하지 않습니다.
  • JENKINS-52549 OPEN 테스트 보고서 XML 파일을 찾을 때 JUnit Plugin이 기호 링크를 따라 가면 안됩니다.
  • JENKINS-52548 OPEN URI 경로 사양을 사용하는 경우 Bitbucket 인증이 실패합니다.
  • JENKINS-52546 OPEN 오류 : DescribableContext에 대한 메소드의 서명이 없습니다.
  • JENKINS-52543 OPEN CVSROOT의 환경 변수는 CVS를 폴링 할 때 평가되지 않습니다.
  • JENKINS-52538 OPEN 작업 편집시 Confluence 게시 구성이 손실 됨
  • JENKINS-52537 RESOLVED ami-0c6bb742864ffa3f3 공개되지 않았습니다.
  • JENKINS-52536 OPEN 자격 증명에 액세스 할 때 Android Signing Plugin의 NullPointerException
  • JENKINS-52532 CLOSED 게이트웨이 옵션을 사용하여 원격으로 사용할 때 예외가 발생합니다.
  • JENKINS-52531 OPEN Windows 슬레이브에서 파이프 라인의 내용에 액세스 할 때 NullPointerException이 발생합니다.
  • JENKINS-52530 podtemplate OPEN 에서 호스트 이름을 덮어 쓰는 옵션을 제공하는 Kubernetes 플러그인
  • JENKINS-52529 OPEN node () 단계는 마지막 실행에서 노드를 재사용하려고 시도해야합니다.
  • JENKINS-52528 OPEN github-api 플러그인을 1.77에서 1.93으로 업데이트하십시오.
  • JENKINS-52524 OPEN p4-plugin + 글로벌 파이프 라인 공유 라이브러리 - 최신 기본 버전 지정 문제
  • JENKINS-52523 CLOSED 확장 된 선택 매개 변수가 허용 목록 변경으로 인해 손상되었습니다.
  • JENKINS-52513 GitHubRepositoryName OPEN 에 GitHub 웹 훅을 추가하지 못했습니다.
  • JENKINS-52512 RESOLVED 실패하지 않기로 설정된 경우에도 보고서 파일이 없으면 종속 노드에서 빌드가 실패합니다.
  • JENKINS-52511 OPEN 플러그인이 GIT_COMMITTER_NAME 및 GIT_AUTHOR_NAME에 값을 제공하지 않습니다.
  • JENKINS-52509 OPEN 경고 : 익명 클래스 hudson.plugins.selenium.PluginImpl $ 1을 (비) 직렬화하려고 시도했습니다.
  • JENKINS-52508 OPEN 이전 된 저장소에 대한 후크 등록을 취소 할 수 없습니다.
  • JENKINS-52506 CLOSED Valgrind xml을 수집하여보고하지 않습니다.
  • JENKINS-52505 OPEN ci.jenkins.io 빌드가 실패합니다.
  • JENKINS-52504 OPEN 컨테이너에 배포 (1.13) 컨테이너 게시 작업에서 관리자 사용자 이름 및 비밀번호를 제공하지 않습니다.
  • JENKINS-52502 OPEN 실행 스크립트가 @tmp 디렉토리로 이동합니다.
  • JENKINS-52501 RESOLVED checkstyle은 사용자에 의한 경고 보고서를 표시하지 않습니다.
  • JENKINS-52500 OPEN 클라우드 에이전트는 라벨이 영구 에이전트와 겹치는 경우 사용되지 않습니다.
  • JENKINS-52499 OPEN Jenkins의 모든 설명, AD_Login으로 변경
  • JENKINS-52497 OPEN Jenkins가 오류로 빌드 할 수 없습니다 - 그루비
  • JENKINS-52493 OPEN 선언 : 단계가 "dockerfile true"와 함께 컨테이너 내부에서 실행되지 않습니다.
  • JENKINS-52489 OPEN 서비스 사용자를 사용하여 Azure 스택 인증
  • JENKINS-52487 OPEN p4-plugin + 글로벌 파이프 라인 공유 라이브러리 - 뷰에 $ {JOB_NAME} 확장 없음
  • JENKINS-52485 OPEN Git Plugin이 설치되어 있지 않으면 Scripted Pipeline의 Git 단계를 건너 뜁니다.
  • JENKINS-52482 OPEN 젠킨스가 사용자 정의 축을 사용하여 잘못된 빌드 노드를 사용함
  • JENKINS-52481 OPEN Kafka 제작자 / 고객이 연결에 실패하면 무한대의 로그를 중지하십시오.
  • JENKINS-52480 OPEN 푸른 바다 메이븐 빌드 문제
  • JENKINS-52478 OPEN 복사 작업 유지 권한
  • JENKINS-52476 OPEN declarative 파이프 라인에서 단계 "script"의 콘솔 출력에서 java.lang.InterruptedException이 발생합니다.
  • JENKINS-52475 OPEN 커버리지 메트릭 타겟의 십진수
  • JENKINS-52473 CLOSED [Git Plugin] 파이프 라인을 사용할 때 환경 변수가 설정되지 않습니다.
  • JENKINS-52472 OPEN SVN 폴링은 변경 사항이없는 빌드를 생성합니다.
  • JENKINS-52466 CLOSED 공유 드라이브 / 로컬 데스크톱에있는 텍스트 파일을 읽을 수 없습니다.
  • JENKINS-52465 OPEN 릴리스 플러그인의 대시 보드 포틀릿에서 최근 릴리스에 대한 링크가 끊어짐
  • JENKINS-52464 IN PROGRESS 파이프 라인에서 RunResultRecorder를 사용할 때의 문제
  • JENKINS-52461 OPEN CIFS '소스 파일'필터를 통한 게시가 작동하지 않습니다.
  • JENKINS-52459 OPEN 플러그인 관리자에서 플러그인을 사용 중지하면 권한 오류로 인해 자바 스크립트 오류가 발생합니다.
  • JENKINS-52451 젠킨스 OPEN 에서 smtp 설정을 저장하면 스택 추적이 인쇄됩니다.
  • JENKINS-52450 IN REVIEW ArtifactManager.onLoad (Run <?,?> build) null 빌드 값 허용
  • JENKINS-52449 OPEN bitbucket 서버가 일정 기간 동안 사용할 수 없을 때 Bitbucket 체크 아웃이 무기한 중지됩니다.
  • JENKINS-52448 OPEN Powershell DSL에 대한 요구 사항이 명확하지 않습니다.
  • JENKINS-52447 OPEN 총 테스트 사례에 대한 잘못된보고
  • JENKINS-52444 OPEN JiraTestDataPublisher.class 구성에 문제가있는 JCasclugin
  • JENKINS-52443 IN REVIEW 열거 형은 JCasc 플러그인에서 지원되지 않습니다.
  • JENKINS-52442 CLOSED bitbucket-scm-filter-aged-refs 플러그인 사용
  • JENKINS-52441 OPEN ID가 'null'인 계정에 대해 기존 API 토큰을 취소 할 수 없습니다.
  • JENKINS-52440 OPEN 클래스 WindowsProcess 스레드가 죽지 않아 Jenkins CPU를 시간이 지남에 따라 촬영합니다.
  • JENKINS-52438 OPEN 글로벌 보안 도구 구성에 액세스 할 수없고 자격 증명 및 글로벌 도구 구성을 구성 할 수 없습니다.
  • JENKINS-52436 OPEN ArrayList.size 또는 Groovy Sandbox 내부에서 처음 평가할 수 없습니다.
  • JENKINS-52434 OPEN 파이프 라인 : notifyBitbucket ()에 너무 많은 매개 변수가 필요합니다.
  • JENKINS-52432 CLOSED 파이프 라인의 타임 아웃이 HubotApprove를 종료하기 위해 두 배의 타임 아웃을 필요로합니다.
  • JENKINS-52429 OPEN JENKINS-48300 : 지연된 파일 시스템에서 -Dorg.jenkinsci.plugins.durabletask.BourneShellScript.HEARTBEAT_CHECK_INTERVAL = 300) [파이프 라인]을 고려하십시오.
  • JENKINS-52427 OPEN 글로벌 설정
  • JENKINS-52420 OPEN [JEP-200] 수업을 직렬화 할 수 없습니다.
  • JENKINS-52418 OPEN ssh를 통해 실행 슬레이브 에이전트를 통해 새 슬레이브를 추가하는 동안 기존의 자격증 명 또는 최근에 추가 한 새 자격 증명을 통한 via 드롭 다운을 선택할 수 없습니다
  • JENKINS-52416 jenkins.err.log의 OPEN 임의 액세스 예외 조항
  • JENKINS-52415 OPEN 작업 영역과 관련이없는 비밀 파일 경로 - 마스터가 Windows, 슬레이브가 Unix 인 경우 눈에 띄게됩니다
  • JENKINS-52414 OPEN 현재 빌드가 새로 고침 될 때까지 빌드 기록 사이드 바의보기에서 가끔씩 사라집니다.
  • JENKINS-52411 OPEN java.lang.OutOfMemoryError : 장기 실행 Fargate 작업을위한 Java 힙 공간
  • JENKINS-52408 OPEN 동일한 파이프 라인에서 여러 작업 : java.io.NotSerializableException : org.jenkinsci.plugins.workflow.job.WorkflowJob
  • JENKINS-52407 OPEN 마켓 플레이스 이미지를 사용하면 '마켓 플레이스 이미지에서 가상 머신 만들기에는 요청시 계획 정보가 필요합니다.'라는 오류 메시지가 나타납니다.
  • JENKINS-52406 OPEN PR을 열 때 "PR로 정리 된 분기 제외"로 예기치 않은 작업 삭제
  • JENKINS- OPEN 52404 copyArtifact를 사용할 때 작업이 무작위로 실패 함
  • JENKINS-52403 OPEN 파이프 라인 작업에 대해 Periodic Build Trigger Column이 표시되지 않습니다.
  • JENKINS-52402 OPEN 자원을 잠글 때 작업이 임의로 실패 함
  • JENKINS-52401 CLOSED DSL에 설명 할 수없는 이상한 오류 메시지가 있습니다.
  • JENKINS-52400 RESOLVED Valgrind가 변환 할 때 xUnit 필수 속성을 추가하지 못했습니다.
  • JENKINS-52397 OPEN 리포지토리에 태그가없는 경우 조직 스캔이 폭발합니다.
  • JENKINS-52395 OPEN StackOverflowError를 사용하여 super 메서드를 호출하는 super 메서드를 호출 할 수 없습니다.
  • JENKINS-52386 OPEN credentials () 매개 변수가 설명에서 HTML을 지원하지 않습니다.
  • JENKINS-52385 OPEN 전체 스테이지보기에서 빌드에 대한 잘못된 링크
  • JENKINS-52384 OPEN Jenkins Build에서 JIRA 문제 생성
  • JENKINS-52383 OPEN 잘못된 POM이 저장소에 배포되었습니다.
  • JENKINS-52382 OPEN 개인 저장소 빌드를 중지하거나 취소 할 수 없습니다.
  • JENKINS-52381 OPEN Jenkins / Checkin now 관리 - Java 스택 추적
  • JENKINS-52380 OPEN Jenkins 2.107.2 작업 상태 표시가 완료되었지만 콘솔 로그에서 작업이 계속 실행 중입니다. 실행중인 작업으로 인해 다른 작업을 빌드 할 수 없습니다.
  • JENKINS-52379 FIXED BUT UNRELEASED 파이프 라인 스크립트를 즉시 업데이트 할 수 없습니다.
  • JENKINS-52378 RESOLVED Git SCM 단계에서 반환 된 개정 상태가 잘못되었습니다.
  • JENKINS-52376 OPEN 기존 커밋에 태그를 추가하여 빌드 트리거
  • JENKINS-52374 OPEN 닫히지 않은 LDAP 연결 문제
  • JENKINS-52373 OPEN 심볼릭 링크를 "Ant 호출"아래의 빌드 파일에 대한 포인팅 경로로 해석해서는 안됩니다.
  • JENKINS-52369 OPEN "Ant 호출"대상에서 -file PATH를 지정하면 작업 디렉토리가 잘못 설정됩니다
  • JENKINS-52368 OPEN FileSystemListParameter : 파이프 라인 작업에 나열되지 않은 파일
  • JENKINS-52367 2.121.1로 CLOSED 업데이트 한 후 역방향 프록시 구성이 손상되었다고합니다.
  • JENKINS-52366 IN REVIEW HPE Application Automation Tools 플러그인을 사용하여 작업 저장 오류 - "TimeslotDuration"클래스 오류
  • JENKINS-52365 OPEN Gerrit 트리거 주석에 푸른 바다 URL (RUN_DISPLAY_URL)을 포함 할 수 없습니다.
  • JENKINS-52364 OPEN SYSTEM 범위의 SSH 자격 증명을 사용할 때 SSH를 통한 체크 아웃이 실패합니다
  • JENKINS-52363 OPEN mvn에서 반환 한 buildInfo에서 빌드 번호를 변경하면 문제가 게시됩니다.
  • JENKINS-52362 OPEN "CpsFlowExecution이 응답하지 않음"으로 인해 Jenkins가 멈 춥니 다.
  • JENKINS-52361 RESOLVED S3에서 빈 숨김이 생성되지 않습니다.
  • JENKINS-52359 OPEN Vault 플러그인과 함께 사용자 정의 CA 인증서를 사용할 수 없습니다.
  • JENKINS-52358 OPEN Jenkins 2.128 깨진 Http / 2 지원
  • JENKINS-52357 REOPENED 2.100 -> 2.129 업그레이드 후 publish-over-SSH config가 사라졌습니다.
  • JENKINS-52355 IN PROGRESS WebSphere 7.0에서 플러그인 배포 실패
  • JENKINS-52354 RESOLVED 암호로 SSH 자격 증명을 사용할 수없는 Git 플러그인
  • JENKINS-52353 OPEN Accelerated-build-now-plugin 1.0.1은 Pipeline과 호환되지 않습니다.
  • JENKINS-52351 OPEN 플러그인 업데이트 확인 = java 충돌
  • JENKINS-52350 OPEN "젠킨스 관리"에서 "노드 관리"를 열 수 없습니다.
  • JENKINS-52349 CLOSED 장시간 작업 시간이 초과되었지만 시간 제한이 구성되어 있지 않습니다.
  • JENKINS-52346 OPEN 젠킨스 플러그인 + TFS
  • JENKINS-52345 RESOLVED 젠킨스 플러그인이 보안 업데이트로 인해 고장 습니까?
  • JENKINS-52343 KafkaClassicCommandTransport RESOLVED 에서 closeRead () 메소드의 예외를 수정했습니다.
  • JENKINS-52341 OPEN JiraTestResultReporter-plugin - Jenkins 작업이 하위 폴더에있는 경우 API testToIssueMapping이 작동하지 않습니다.
  • JENKINS-52340 jenkins RESOLVED 에서 Android Gradle 프로젝트를 빌드 할 수 없습니다.
  • JENKINS-52338 OPEN JiraTestResultReporter-plugin - "자동 링크 해제 문제"확인란에 저장된 값이로드되지 않습니다.
  • JENKINS-52335 OPEN 주입 된 env는 "트리거 / 호출 프로젝트"및 "멀티 잡 페이스"에서 다르다.
  • JENKINS-52334 OPEN 모드는 없을 때 기본적으로 NORMAL로 설정되어야합니다.
  • JENKINS-52333 OPEN ExtremFeddback이 폴더에서 실패합니다.
  • JUNKINS-52327 RESOLVED xunit 사용자 정의 도구 테스트 보고서 공개시 java.nio.file.AccessDeniedException
  • JENKINS-52326 SSH_ASK_PASS OPEN 를 기본값으로 설정하면 보안 텍스트 토큰을 사용하는 workflow-remote-loader-plugin이 손상됩니다.
  • JENKINS-52325 RESOLVED jenkins가 빌드 디렉토리를 소유하지 않으면 아카이브 아티팩트가 실패합니다.
  • JENKINS-52319 OPEN userData 필드는 명시 적으로 ""(빈 문자열)로 초기화되지 않을 때 NPE를 트리거합니다.
  • JENKINS-52318 OPEN SafeTimerTask 과도한 로깅
  • JENKINS-52317 OPEN '실패'상태에서 멈춘 에이전트
  • JENKINS-52316 OPEN 테스트 통계 그리드에 대한 데이터가 0으로 표시되고 테스트 실행시 차트 통계 통계가 표시되지 않음
  • JENKINS- OPEN 52314 gihub org 작업과 API가 작동하지 않습니다.
  • JENKINS-52307 REOPENED BlueOcean : 최상위 수준의 작업로드로 인해 자바 스크립트 오류가 발생 함
  • JENKINS-52303 CLOSED 아티팩트가 NBM (NetBeans Module)이고 항아리로 소비되면 다운 스트림 파이프 라인이 트리거되지 않습니다.
  • JENKINS-52302 OPEN [SRF] testrun 이름에 dot / s가 포함 된 경우 Jenkins에서 보고서를 제출하지 못했습니다.
  • JENKINS-52298 OPEN [SRF] Selenium 보고서에 중복 된 단계가 표시됩니다.
  • JENKINS-52297 OPEN [SRF] Jenkins에서 취소하면 SRF에서 실행이 취소되지 않습니다.
  • JENKINS-52296 RESOLVED DependencyGraph 지속성으로 작업을 읽을 수 없음
  • JENKINS-52294 OPEN 샌드 박스 스크립트에서 인덱스 또는 범위를 사용할 수 없습니다.
  • JENKINS-52293 완료된 OPEN 노드 요청을 수락하지 못함
  • JENKINS-52287 OPEN 배지 플러그인으로 작성된 여러 개의 ShortText를 빌드 내역 창에서 래핑하지 못했습니다.
  • JENKINS-52283 CLOSED Jenkins Slaves는 마스터없이 통신되지 않습니다. 다시 시작한 후
  • JENKINS-52278 OPEN "작업 공간을 삭제할 수 없습니다 : 원격 파일 조작이 실패했습니다"
  • JENKINS-52277 OPEN Blueocean이 동일한 이름을 가진 이슈를 두 개 이상 표시하지 않습니다.
  • JENKINS-52276 OPEN 공용 IP에서 BlueOcean에 액세스 할 수 없습니다.
  • JENKINS-52275 OPEN configuration-as-code를 통해 설정하면 레이블 필드가 무시됩니다.
  • JENKINS-52273 OPEN 선언적 파이프 라인에서 git-parameter-plugin 지원
  • JENKINS-52272 OPEN Bitbucket 분기 소스 플러그인이 리포지토리 목록을 올바르게 업데이트하지 않습니다.
  • JENKINS-52271 OPEN 두 노드가 동일한 노드에서 실행될 때 두 번째 에이전트가 영구적으로 오프라인 상태입니다.
  • JENKINS-52270 OPEN 원격 실행 모드에서 매개 변수를 사용할 수 없습니다.
  • JENKINS-52269 OPEN 빌드 실패시 클린업이 작동하지 않습니다.
  • JENKINS-52268 OPEN 모든 git checkout이 알림을 전송합니다.
  • JENKINS-52267 RESOLVED gitlab-plugin 버전 1.5.7에서 파이프 라인 호환성 깨짐
  • JENKINS-52266 CLOSED Groovy 클래스에서 자격 증명을 사용할 수 없습니다.
  • JENKINS-52265 OPEN 젠킨스 파이프 라인 (Groovy) 유형의 작업에서 JiraFinder 플러그인을 사용하십시오.
  • JENKINS-52264 OPEN 도커에서 파이프 라인 작업을 실행하는 중 오류가 발생했습니다.
  • JENKINS-52263 OPEN "컨테이너 작성"Docker 빌드 단계의 예외
  • JENKINS-52262 OPEN VirtualFile을 사용하여 작업 영역 밖으로 향하는 심볼릭 링크를 복사 할 수 없습니다.
  • JENKINS-52261 RESOLVED 빌드가 다시 빌드 된 후 병렬 단계가 NOT_BUILT 대신 FINISHED로 표시됩니다.
  • JENKINS-52260 OPEN 메시지를 확인하고 "오류 : 업데이트를 쿼리하지 못했습니다."오류 : 정의되지 않은 "docker-cloud '속성을 읽을 수 없습니다.
  • JENKINS-52256 OPEN 팬텀 잡스 마스터
  • JENKINS-52254 RESOLVED 접두사를 사용하여 구성 확인
  • JENKINS-52253 x RESOLVED 여러 공구 유형의 경우 유니트 만 첫 번째 가공
  • JENKINS-52252 OPEN Sonar QualityGate는 분석이 실패하더라도 계속 진행됩니다.
  • JENKINS-52250 RESOLVED us-east-1 대신 미국 표준 지역
  • JENKINS-52249 OPEN 병렬 빌드가 Plot.savePlotData의 AIOOBE로 이어진다.
  • JENKINS-52246 OPEN Remoting "-tunnel"옵션은 더 이상 사용되지 않으며 재 설계가 필요합니다.
  • JENKINS-52241 CLOSED Windows에서 git bash를 지원합니다.
  • JENKINS-52240 CLOSED 입력 지시문이 조건을 준수하지 않습니다.
  • JENKINS-52234 RESOLVED 일부 시스템에서 테스트 실패 수정
  • JENKINS-52232 OPEN 1.14로 업그레이드 한 후 자격 증명을 사용할 수 없습니다.
  • JENKINS-52230 OPEN 로그 회전의 레이스 컨디션이 경고 로그로 연결됩니다.
  • JENKINS-52229 OPEN 'perl'은 내부 또는 외부 명령, 작동 가능 프로그램 또는 배치 파일로 인식되지 않습니다.
  • JENKINS-52228 OPEN java.lang.internalerror를 가져 오는 Jenkins 작업을 빌드 할 수 없습니다.
  • JENKINS-52227 OPEN ssh를 사용하여 Git 저장소에 연결할 수 없습니다.
  • JENKINS-52224 CLOSED KubernetesApply 단계가 잘못된 서비스 이름으로 실패합니다.
  • JENKINS-52223 OPEN jenkins는 서비스를 중지 한 후에도 여전히 많은 CPU 사용량을 사용하고 있습니다.
  • JENKINS-52222 CLOSED Kubernetes Pipeline Plugin의 kubernetesApply 서비스 이름이 잘못되었습니다.
  • JENKINS-52219 OPEN 플러그인을 배포하여 WebSphere에 ear 파일을 올바르게 배치하지 못함
  • JENKINS-52218 OPEN GitHub Committer 권한 부여 전략 결과를 통해 인증 된 사용자로 Multibranch 파이프 라인 작업을 생성하면 오류가 발생합니다.
  • JENKINS-52217 OPEN 1.40의 기호 링크에서 아티팩트가 실패합니다.
  • JENKINS-52216 OPEN 끌어 오기 요청 및 파이프 라인 에이전트
  • JENKINS-52215 IN PROGRESS Azure ADDS의 Jenkins 인증 문제
  • JENKINS-52214 OPEN BitBucket에서 성공적인 빌드가 진행 중입니다.
  • JENKINS-52211 OPEN Docker 파이프 라인 플러그인 - withDockerContainer 단계가 expeted (으)로 작동하지 않습니다.
  • JENKINS-52209 OPEN [시간 제한으로 인해 중첩 된 단계를 취소하면] 작업이 중간에 중단됩니다.
  • JENKINS-52207 OPEN BitbucketSCMSource를 사용할 때 SCMFileSystem을 빌드 할 때 오류가 발생했습니다.
  • JENKINS-52206 OPEN 플러그인을 업그레이드 한 후 "Restarting Jenkins"가 멈 춥니 다.
  • JENKINS-52204 2.1.129로 RESOLVED 업그레이드 한 후 Jenkins Windows Agent를 시작하지 못했습니다.
  • JENKINS-52202 RESOLVED xUnit은 병렬 단계의 경우 "모든 테스트 보고서가 비어 있습니다"라고보고하지만 보고서는 비어 있지 않습니다.
  • JENKINS-52201 OPEN ID가 전송되지 않아 ID 공급자에 연결할 수 없습니다.
  • JENKINS-52198 OPEN 사용자 세션이 만료되어 다시 로그인 할 수 없습니다.
  • JENKINS-52197 OPEN 플러그인 파일 이름은 <plugin> .hpi로 정규화되어야합니다.
  • JENKINS-52195 CLOSED P4 태스크 : failed : com.perforce.p4java.exception.ConnectionException : java.net.SocketException : p4sync를 실행할 때 연결 재설정 됨
  • JENKINS-52193 FIXED BUT UNRELEASED Jenkins 파이프 라인 정의 선택 비어 있음
  • JENKINS-52192 OPEN 심각 : ZIP 항목을 만들 수 없음 (백업 폴더가 NFS 공유에서 호스팅되는 경우)
  • JENKINS-52189 IN PROGRESS GraphListener가 FlowStartNode를 수신하지 않습니다.
  • JENKINS-52184 RESOLVED 파이프 라인 유틸리티 로 암호를 읽을 수 없습니다.
  • JENKINS-52181 IN REVIEW jenkins-cli를 사용하여 사용자에게 작업 / 빌드 권한이 있어야하는 프로젝트의 콘솔을 가져옵니다.
  • JENKINS-52180 OPEN 설치를 도와주세요.
  • JENKINS-52179 OPEN 직렬화시 잘못된 데이터 매핑
  • JENKINS-52177 OPEN ArrayIndexOutOfBoundsException 테스트 결과 트렌드 차트 검색 중
  • JENKINS-52174 OPEN 유형 실행의 매개 변수가 params에 추가되지 않았습니다.
  • JENKINS-52173 RESOLVED gtester / glib2 입력을 junit 형식으로 변환 할 때 xUnit이 실패합니다
  • JENKINS-52172 RESOLVED jenkins 슬레이브 인증 방법을 변경하려면 관리자 승인이 필요합니다.
  • JENKINS-52171 OPEN 파이프 라인에서 Jira 플러그인과 호환 되지 않는 Gitlab 플러그인
  • JENKINS-52170 OPEN Dashboard View 플러그인의 경우 '전체 화면보기 - 표준 Jenkins 패널 숨기기'가 선택되어있는 경우보기를 편집하려면 어떻게해야합니까?
  • JENKINS-52168 IN PROGRESS Dockerfile이 현재 이미지 이름과 동기화되지 않았습니다.
  • JENKINS-52167 RESOLVED 권한 부여> 매트릭스 기반 보안에서 크롬의 권한 이름이 회전되지 않습니다.
  • JENKINS-52166 OPEN Jenkins가 원시 https를 사용할 때 응답 없음
  • JENKINS-52164 RESOLVED URL이 sidepanel.jelly에 정의되지 않은 경우 새 AbstractItem 이름 바꾸기 템플릿이 손상되었습니다.
  • JENKINS-52162 OPEN 로그인 양식이 자동 완성시 ENTER를 잘못 제출합니다.
  • JENKINS-52159 RESOLVED Jenkins Queue DoS는 QueueItemSorter 확장이 런타임 예외를 throw 할 때 발생합니다.
  • JENKINS-52157 CLOSED Jenkins 플러그인은 개발시 작동하지만 설치시 실패합니다.
  • JENKINS-52156 OPEN JIRA 워크 플로우 조치로 진행 문제가 상태 변경 실패
  • JENKINS-52154 CLOSED 전달 된 단위 테스트의 출력을 확장 할 수 없습니다.
  • JENKINS-52153 IN REVIEW 프로세스 트리 종료 거부 거절 캐시 논리에 널 (null) 채널 점검이 없습니다.
  • JENKINS-52152 CLOSED xunit는 3 자릿수 이상 또는 지수 표기법을 사용하여 junit 시간 속성을 읽을 수 없습니다.
  • JENKINS-52151 RESOLVED 분기 이름의 슬래시가 이슈에 액세스 할 수 없게 만듭니다.
  • JENKINS-52150 2.107.3으로 OPEN 업그레이드 한 후 높은 CPU sys 시간 소비
  • JENKINS-52149 OPEN 작업이 전파되지 않거나 try-finally 블록에있을 때 wfapi가 실패 / 중단 된 작업의 잘못된 상태를 표시합니다.
  • JENKINS-52148 RESOLVED zos에서 하위 모듈을 업데이트 할 수 없습니다.
  • JENKINS-52147 OPEN 저장소가 태그를 지속적으로 검사하여 속도 제한을 초과합니다.
  • JENKINS-52146 OPEN SCP가 Windows와 함께 파일 전송을하지 못함
  • JENKINS-52145 RESOLVED Windows 컴퓨터에서 실행할 때 P4 플러그인 테스트가 실패합니다.
  • JENKINS-52144 OPEN 플러그인으로 창을 프로비저닝 할 수 없음> 1.4.1
  • JENKINS-52142 OPEN 클로저의 기본값이 작동하지 않습니다.
  • JENKINS-52140 OPEN 플러그인을 설치할 수 없습니다.
  • JENKINS-52139 IN REVIEW 순서에 따라 테스트가 실패하는 경우가 있음
  • JENKINS-52136 OPEN JIRA 이슈 커스텀 필드 업데이트 필드가 실패했습니다.
  • JENKINS-52135 RESOLVED 자원 처리기 플러그인 0.9로 인해 작업이 실패합니다.
  • JENKINS-52134 BitBucket에서 OPEN 빌드 상태가 Mercurial 저장소로 보내지지 않습니다.
  • JENKINS-52133 CLOSED java.lang.SecurityException : 암호화 정책 디렉토리를 읽을 수 없습니다 : 무제한
  • JENKINS-52130 CLOSED 이전 브라우저에서는 작동하지 않기 때문에 Object.values의 사용을 바꿉니다.
  • JENKINS-52129 IN PROGRESS CacheLoader가 키 그룹 / 프로젝트에 대해 널 (NULL)을 리턴했습니다.
  • JENKINS-52128 OPEN 플롯 플러그인 (파이프 라인)의 NullPointerException
  • JENKINS-52127 OPEN Jenkins와 JIRA 연결하기
  • JENKINS-52126 IN PROGRESS crowd2 플러그인은 jenkins에서 시간 초과 읽기
  • JENKINS-52125 OPEN jenkins master : <slave name>에 연결할 수 없습니다 :로드가 많거나 명백한 네트워크 문제가없는 java.lang.InterruptedException
  • JENKINS-52124 IN PROGRESS Jenkins Crowd2 플러그인이 CROWD의 모든 그룹을 반환하지 않습니다.
  • JENKINS-52121 OPEN 임베디드 Winstone 문서에 sessionEviction 플래그가 없습니다.
  • JENKINS-52119 RESOLVED JiraContainer / Dockerefile이 오래된 위치에서 Atlassian SDK를 다운로드하려고합니다.
  • JENKINS-52118 RESOLVED 시스템 Groovy 스크립트에서 빌드 이름을 설정하고 ENV 변수를 주입 할 때 java.lang.UnsupportedOperationException이 발생합니다.
  • JENKINS-52117 OPEN Intellij Idea Debugger가 실험 Java 10 이미지에 연결하지 못함
  • JENKINS-52116 OPEN 코어 CD - GitHub에서 커밋 : 증분 업데이트 상태가 WAR 대신 CLI 패키지를 가리킴
  • JENKINS-52115 OPEN jira-plugin은 jql이 맞지만 내 클라우드 jira 구독에서 티켓을 찾을 수 없습니다.
  • JENKINS-52114 OPEN 선언 파이프 라인 병렬 스테이지 게시물 이벤트 비 결정적
  • JENKINS-52113 OPEN CHM 파일이 확장명없이 다운로드되었습니다.
  • JENKINS-52112 OPEN 개인 Gitea 리포지토리가 보이지 않습니다.
  • JENKINS-52111 OPEN Multibranch Pipeline Project에서 "SNAPSHOT dep가 발생할 때마다 빌드"옵션이 쓸모 없습니까?
  • JENKINS-52110 OPEN SVN 추가 후 멀티 채널 파이프 라인에 대한 LastChanges 플러그인 문제
  • JENKINS-52108 OPEN java.lang.UnsupportedOperationException : 보안 상 이유로 java.util.concurrent.atomic.AtomicInteger를 마샬링하지 않습니다. https://jenkins.io/redirect/class-filter/를 참조하십시오.
  • JENKINS-52107 RESOLVED nunit-version 속성에 숫자 만 포함되어 있지 않으므로 NUnit 2.1 보고서에 대한 변환 예외가 있습니다.
  • JENKINS-52104 CLOSED 플러그인은 빌드 도구의 인수 필드에 항상 "all"을 채 웁니다.
  • JENKINS-52103 OPEN Unity3d 설치 디렉토리가 최신 Jenkins 2.128에 표시되지 않습니다.
  • JENKINS-52101 CLOSED -Dblueocean.collectRuns.threads = 0으로 설정하면 IllegalArgumentException이 발생합니다.
  • JENKINS-52100 OPEN Blue Ocean Pipelines보기가 즐겨 찾기가 아닌 즐겨 찾기 목록에 즐겨 찾는 파이프 라인을 반영하지 않습니다.
  • JENKINS-52099 OPEN jenkins-cli는 익명 사용자에 대한 전체 / 읽기 권한이 필요합니다.
  • JENKINS-52091 OPEN groovy postbuild를 사용하여 작업에 downtrigger가 발생하는 동시 매트릭스 빌드에서 throw되는 IllegalMonitorStateException
  • JENKINS-52089 CLOSED vectorcast-execution-plugin
  • JENKINS-52087 OPEN JIRA 사이트 설정을 검증 할 수 없습니다 : 최신
  • JENKINS-52086 RESOLVED Github 분기 트리거 가능 JEP-200 문제
  • JENKINS-52085 OPEN 대기열의 작업이 정렬되지 않았습니다.
  • JENKINS-52084 RESOLVED 순차 단계 게시 섹션이 예상 컨텍스트에서 실행되지 않습니다.
  • JENKINS-52082 OPEN 파이프 라인보기 빌드가 예상대로 작동하지 않습니다.
  • JENKINS-52080 CLOSED Blue Ocean 1.6.0을 사용하는 Docker 에이전트에서 symlink가 포함 된 repos에 대한 Git 체크 아웃이 실패합니다.
  • JENKINS-52078 OPEN Github 플러그인이 개인 저장소에서 가져올 수 없습니다.
  • JENKINS-52074 RESOLVED 메트릭 플러그인이 파이프 라인 대기 시간을 올바르게 추적하지 않습니다.
  • JENKINS-52073 OPEN 지원되는 WebDriver 브라우저를 선택할 수 없습니다.
  • JENKINS-52072 RESOLVED 메트릭 플러그인이 2.19 이전에 Jenkins에 동적으로 설치되었을 때 완전히 작동하지 않습니다.
  • JENKINS-52071 IN REVIEW AD 플러그인에서 'Jenkins 내부 데이터베이스 사용' 관련 문제
  • JENKINS-52069 OPEN 심각 : Docker Java 10에서 실행할 때 Email Extension을 설치하지 못했습니다.
  • JENKINS-52067 RESOLVED 새 메트릭을 등록하는 동적으로 설치된 플러그인은 다시 시작할 때까지 등록되지 않습니다.
  • JENKINS-52066 OPEN 멀티 브랜치 파이프 라인 작업으로 변화 당 설문 조사
  • JENKINS-52065 OPEN 푸른 바다는 입력 단계를 보여 주지 못함
  • JENKINS-52063 IN REVIEW JBoss Marshalling의 불법 반사 액세스
  • JENKINS-52060 OPEN 자격증 명 문제 : 'nouser'사용자의 액세스가 'p4 protect'에 의해 활성화되지 않았습니다.
  • JENKINS-52059 OPEN checkout scm 단계는 non-multibranch 파이프 라인에서 GIT _ *** 변수로 환경을 채우지 않습니다.
  • JENKINS-52057 CLOSED xUnit 테스트 결과 추세는 여러 결과 파일을 구문 분석 할 때 임의 통계 를가집니다.
  • JENKINS-52056 CLOSED xUnit 플러그인은 distingushing 테스트가 아닙니다.
  • JENKINS-52055 CLOSED 요청 처리 중 문제점이 발생했습니다. gitlab 플러그인을 설치 한 후 확인하십시오.
  • JENKINS-52054 RESOLVED 구성 시스템의 고급 단추가 더 이상 표시되지 않습니다.
  • JENKINS-52053 IN PROGRESS Jenkins stash가 npm 설치 후 실패했습니다.
  • JENKINS-52051 OPEN git-parameter exec : nc : 찾을 수 없습니다.
  • JENKINS-52047 RESOLVED AD 업그레이드 후 사용자 및 그룹을 찾을 수 없습니다.
  • JENKINS-52046 CLOSED Jenkins가 aws codepipeline 및 S3에 오류 발생
  • JENKINS-52045 RESOLVED 글로벌 보안 구성에 대한 고급 구성 누락
  • JENKINS-52043 OPEN manager.removeBadge (index)는 UnsupportedOperationException을 발생 시킵니다.
  • JENKINS-52042 OPEN Job DSL 플러그인에서 잘못된 cron 표현식을 제공하면 Jenkins가 오류를 던지지 않습니다.
  • JENKINS-52041 OPEN 은 docker-compose를 사용할 수 없습니다 - 최소화 된 작업 공간 이름은 밑줄
  • JENKINS-52040 IN REVIEW Jira-Issue-Updater 플러그인이 Jenkins Pipeline Script에서 예상대로 작동하지 않습니다.
  • JENKINS-52039 RESOLVED Dropbox를 통해 게시하면 "ERROR : 게시 할 때 예외, 예외 메시지 [null]"이 반환됩니다.
  • JENKINS-52038 IN PROGRESS 빌드 단계 및 선택 매개 변수 플러그인을 사용할 때 모든 값을 허용합니다
  • JENKINS-52037 CLOSED kubernetes 플러그인이 Java7의 Jenkins 2.32.1에로드되지 않습니다.
  • JENKINS-52036 CLOSED 목록 [범위] 연산자가 샌드 박스에서 허용되지 않습니다.
  • JENKINS-52034 OPEN 실패시 사용자 정의 이미지 삭제
  • JENKINS-52033 CLOSED JNLP를 통해 Docker Agent를 실행할 수 없습니다.
  • JENKINS-52027 CLOSED WAS 9.0에 ear 파일을 전개 할 수 없습니다.
  • JENKINS-52024 IN REVIEW mvn을 사용하여 Java 10에서 컴파일 / 테스트 할 수 없습니다.
  • JENKINS-52023 OPEN Groovy를 Java 10 용 2.4.12로 업데이트하면 파이프 라인이 누수 메타 공간 메모리를 만듭니다
  • JENKINS-52021 OPEN 스팟 인스턴스가 템플리트 설명으로 필터링되지 않았습니다.
  • JENKINS-52020 OPEN jobConfigHistory.xml 파일에서 구성이 적용되지 않았습니다.
  • JENKINS-52019 RESOLVED Java 10을 사용한 선언적 빌드 실패
  • JENKINS-52018 IN PROGRESS 사전 빌드 스크립트가 실패 할 경우 게시 빌드 스크립트가 실패합니다.
  • JENKINS-52017 RESOLVED Metrics Plugin은 노출되지 않은 모듈 API에 의존합니다.
  • JENKINS-52016 OPEN SSH를 통한 게시를 위해 작동하지 않는 매개 변수 및 env 빌드 변수
  • JENKINS-52015 IN PROGRESS 새 에이전트를 만들 때 빈 자격 증명 드롭 다운
  • JENKINS-52014 IN REVIEW 플러그인 POM은 Java 8 이전 버전에서만 작동하도록 단일 버전 String Hardcoded를 사용합니다.
  • JENKINS-52011 IN REVIEW workflow-cps : 객체 스트림을 정리할 때 java.io.ObjectStreamClass에 대한 액세스가 잘못되었습니다.
  • JENKINS-52008 OPEN "Jenkins가 시작되는 동안 기다려주십시오"페이지가 2.128 에서 나쁘게 보입니다.
  • JENKINS-52007 RESOLVED 플러그인 POM : 기본 동물 스니퍼가 jdk10에서 작동하지 않습니다.
  • JENKINS-52006 RESOLVED DevTools : Extra Enforcer Rules 1.0-beta-6은 다중 릴리스 JAR을 지원하지 않습니다.
  • JENKINS-52005 OPEN catchError는 오류가 발생한 단계를 시각적으로 알려줍니다.
  • JENKINS-52002 OPEN GitHub 플러그인 분기 태그 처리가 잘못되었습니다.
  • JENKINS-52001 RESOLVED JBoss Remoting. Java10에서 실행할 때 "역순 비교 자에 대한 표준 필드가 없습니다"
  • JENKINS-51999 RESOLVED Jenkins는 notifyCommit이 요청 된 후 초기 빌드에 추가 매개 변수를 전달하지 않습니다.
  • JENKINS-51997 OPEN BuildPipelinePlugin - 2.121.1로 업그레이드 한 후 빌드 파이프 라인보기가로드되지 않습니다.
  • JENKINS-51996 OPEN changedLinesOnly == true 일 때 Sonar Gerrit 플러그인이 의견을 게시하지 않습니다.
  • JENKINS-51995 OPEN sun.misc.Signal은 향후 java에서 사용할 수 없습니다.
  • JENKINS-51993 OPEN nunit 2 결과 파일을 파싱하지 못했습니다.
  • JENKINS-51992 OPEN 파이프 라인과 함께 사용할 때 모든 경고는 모든 빌드가 "고정"및 "새"입니다.
  • JENKINS-51991 RESOLVED JCasC config 내보내기가 Java 10, "Bean을 지정하지 않았습니다"의 최신 버전에서 실패합니다.
  • JENKINS-51990 OPEN plugins.txt로 도커 이미지 빌드를 실행하면 Java 10 기본 이미지에 경고가 생성됩니다.
  • JENKINS-51983 OPEN Jenkins 구성을 저장할 수 없음 - 새로 설치
  • JENKINS-51982 IN REVIEW 다운로드를 허용하지 않는 HockeyApp 업로드에 대한 설치 링크가 잘못 설정되었습니다.
  • JENKINS-51981 CLOSED RedHat 저장소에 v2.121.1 LTS가 없습니다.
  • JENKINS-51980 IN PROGRESS Jenkins 업그레이드 후 누락 된 빌드 트리거 섹션
  • JENKINS-51979 IN PROGRESS SAXException으로 서브 버전 체크 아웃이 실패합니다.
  • JENKINS-51977 CLOSED 테스트 별칭이 숨겨진 시작 부분에 표시됩니다.
  • JENKINS-51972 OPEN 풀 요청 상태 요청에 공백이 statusName으로 포함되어 있습니다.
  • JENKINS-51971 RESOLVED StreamTaskListener # getCharset ()이 API를 위반하여 null을 반환 할 수 있습니다.
  • JENKINS-51970 OPEN SafeHTML 설명이 irc, ssh 등과 같은 URI를 사용하여 하이퍼 링크를 삭제합니다.
  • JENKINS- OPEN 51968 sshagent 플러그인이 Windows 10 버전 1803에서 깨졌습니다.
  • JENKINS-51964 OPEN 골란 : 1.10 mkdir /.cache/go-build/00 : 허가 거부 됨
  • JENKINS-51962 RESOLVED 스테이지 A의 중첩 된 스테이지에서 실패로 인해 스테이지 B가 건너 뛰지 않습니다.
  • JENKINS-51960 OPEN ClassNotFoundException : org.apache.xerces.parsers.SAXParser
  • JENKINS-51959 CLOSED Linux 슬레이브가 간헐적으로 마스터에 대한 연결을 끊음
  • JENKINS-51958 IN PROGRESS 기본 파이프 라인 작업 구성 : "주기적으로 빌드"는 "Poll SCM"과 동일합니다.
  • JENKINS-51957 OPEN JaCoCo Coverage 파이프 라인이 병렬 인 여러 프로젝트에 대한 보고서는 정확히 같습니다.
  • JENKINS-51955 RESOLVED SlaveComputer # 유효한 API 사용의 경우 setChannel (Channel, OutputStream, Channel.Listener)이 null을 throw 할 수 있습니다.
  • JENKINS-51954 OPEN p4 플러그인 릴리스 2 메시지
  • JENKINS-51952 OPEN Jenkins ** 게시물 작성 작업 **, ** Stop Docker Containers ** failed
  • JENKINS- RESOLVED 51951 Azure cli는 JMESpath 쿼리 구문을 지원하지 않습니다.
  • JENKINS-51950 RESOLVED 힘내 플러그인 태그
  • JENKINS-51949 OPEN 사용자 지정 레지스트리에 로그인하지 못하는 선언적 파이프 라인의 Docker 에이전트
  • JENKINS-51948 IN PROGRESS ExecutorStepExecution.PlaceholderTask getEnclosingLabel / computeEnclosingLabel은 노드가 잘못 계산되어 에이전트가없는 경우 병렬로 병합 단계가 잘못 지정됩니다.
  • JENKINS-51947 OPEN 관련이없는 확장 점의 기호가 구문과 충돌합니까?
  • JENKINS-51946 OPEN TFS 플러그인 충돌
  • JENKINS-51940 RESOLVED 보유 시간은 장기 실행 태스크를 고려하지 않습니다.
  • JENKINS-51939 CLOSED Jenkins가 https://myxample.jenkins.com/securityRealm/#로 리디렉션하고 404를 찾을 수 없음을 알립니다.
  • JENKINS-51937 RESOLVED Credenitals : pop-dialog는 https 대신 하드 코드 된 http를 사용합니다.
  • JENKINS-51935 OPEN null을 중단 하시겠습니까?
  • JENKINS-51934 IN PROGRESS 클라이언트는 업데이트를 다운로드 할 때 정상적으로 오류를 처리 할 수 있어야합니다.
  • JENKINS-51933 OPEN 게시 작업이 CIFS 작업 설정으로 작동하지 않습니다.
  • JENKINS-51932 OPEN 지시어 생성기 :`when`이 누락되었습니다. isRestartedRun ()`
  • JENKINS-51931 OPEN 지시 생성기는`when -> allOf -> (아무것도 없음)`과 함께 NPE를 생성합니다.
  • JENKINS-51930 OPEN github api 할당량을 두 드릴 때 Executors가 잠김.
  • JENKINS-51928 IN PROGRESS 타임 아웃은 가장 내부의 try-catch에 의해 잡히지 만, 타임 아웃 단계를 감싸는 try-catch에 의해 잡혀 야합니다
  • JENKINS-51923 OPEN 노드 메모리가 하드 제한이 아닌 소프트 제한 으로 끝납니다.
  • JENKINS-51922 CLOSED 플러그인은 파이프 라인에서 withMaven을 호출 할 때마다 "maven"액션을 만듭니다.
  • JENKINS-51921 CLOSED Prevent onClick of generated syntetic events in dropDown
  • JENKINS-51920 CLOSED jUnit output of pytest/Selenium test fail to parse
  • JENKINS-51919 CLOSED jUnit output of PHPUnit test fail to parse
  • JENKINS-51917 OPEN ERROR: Step ‘Publish JUnit test result report’ failed: None of the test reports contained any result
  • JENKINS-51914 CLOSED junit output of nosetests fails to parse
  • JENKINS-51913 OPEN Post-build action "Archive the artifacts" prints exception to console when no artifacts found
  • JENKINS-51912 OPEN Unable to add user scope credentials in jenkins 2.74 version
  • JENKINS-51911 CLOSED Jenkins refuses to send emails to authorised users when using Role Strategy permissions
  • JENKINS-51909 CLOSED Refusing to marshal net.sf.json.JSONObject for security reasons; see https://jenkins.io/redirect/class-filter/
  • JENKINS-51908 OPEN DOS (8.3) short path format is not supported
  • JENKINS-51907 OPEN Git fetch with submodules fails when an submodule has different commit --no-recurse-submodules needed
  • JENKINS-51905 OPEN Unable to deploy the ear file on to WAS 9.0
  • JENKINS-51904 CLOSED cmake plugin install from archive paths are wrong
  • JENKINS-51902 OPEN build-timestamp-plugin does not ignore empty 3rd field 'shift timestamp'
  • JENKINS-51901 IN PROGRESS build.doStop() does not stop all parallel jobs
  • JENKINS-51900 RESOLVED could not install Apache HttpComponents Client 4.x API plugin
  • JENKINS-51892 OPEN URLTrigger plugin update 0.43 disrupts JSON polling
  • JENKINS-51891 OPEN Pipelines which need a node with a specific label do not proceed after adding label to a node
  • JENKINS-51890 CLOSED junit output of jasmine-reporters fails to parse
  • JENKINS-51889 RESOLVED Do not use com.google.common.io.NullOutputStream in SlaveComputer
  • JENKINS-51888 OPEN /etc/init.d/jenkins handles PIDs incorrectly when running multiple masters
  • JENKINS-51887 RESOLVED Code Coverage API: Need description
  • JENKINS-51878 OPEN Random Remoting issues - ChannelClosed
  • JENKINS-51875 OPEN Jenkins spawns two builds (for two branches) after notifyCommit detects changes
  • JENKINS-51874 OPEN Parameterized Remote Trigger does not use URL for Build Token Root Plugin
  • JENKINS-51873 RESOLVED Investigate multiple agents support
  • JENKINS-51872 OPEN Dropdown options appear blank in Declarative Directive Generator
  • JENKINS-51871 REOPENED Java 11 Docker Image: Invalid Manifest format when loading Git Client Plugin 2.7.2, JDK 11ea+18 is required
  • JENKINS-51870 OPEN Pipeline Model Definition: Illegal reflective access to Groovy objects
  • JENKINS-51869 OPEN Drop --first-parent from rev count
  • JENKINS-51866 CLOSED launcing slave detects non existing JDK
  • JENKINS-51865 OPEN Stage locks are created for skipped stages in declarative pipeline
  • JENKINS-51864 IN PROGRESS Native memory leak in Pipeline
  • JENKINS-51863 OPEN EC2 Plugin: Connectivity issues
  • JENKINS-51862 OPEN reverse proxy authentication error
  • JENKINS-51861 OPEN Missing CORS header Access-Control-Allow-Origin
  • JENKINS-51859 OPEN Unable to call super methods inside closure defined in class method
  • JENKINS-51858 RESOLVED Failed to save build record
  • JENKINS-51855 OPEN Broken graph view when the flow is more complex
  • JENKINS-51854 OPEN LinkageError while performing UserRequest:hudson.scm.SubversionSCM
  • JENKINS-51853 OPEN CIFS configurations for a Job are getting lost after restarting the jenkins
  • JENKINS-51852 OPEN Since 0.10 the glob matching broken/incompatible
  • JENKINS-51850 IN PROGRESS Functions of xcode plugin "Change Bundle ID" does not work properly.
  • JENKINS-51849 OPEN Plugins install fails due to java.net.SocketTimeoutException: Read timed out error
  • JENKINS-51848 OPEN Ruby-runtime plugin fails to upgrade
  • JENKINS-51846 OPEN Source Code View: Tooltip for Duplicate Code is missing
  • JENKINS-51845 RESOLVED Warning trend graph inconsistent in Pipeline
  • JENKINS-51844 RESOLVED Communication link over Kafka is not stable
  • JENKINS-51843 RESOLVED KafkaClassicCommandTransport may lose messages in the read() method
  • JENKINS-51842 IN PROGRESS Unreliable classloading chain
  • JENKINS-51840 OPEN Java 10: Illegal reflective access by XStream on the agent side
  • JENKINS-51838 OPEN P4-Plugin: No polling log if Lightweight checkout option is checked
  • JENKINS-51832 RESOLVED SSHD Module startup fails on Java 10
  • JENKINS-51829 RESOLVED Remoting Kafka Plugin does not get changes applied
  • JENKINS-51828 RESOLVED Incorrectly-constructed sequential stages cause a NPE
  • JENKINS-51827 OPEN Randon String in branch name in multibranch pipeline on jenkins master server
  • JENKINS-51826 OPEN Zephyr for JIRA not showing in list of available Jenkins post-build actions
  • JENKINS-51819 RESOLVED External artifacts are not deleted when the build is deleted
  • JENKINS-51818 RESOLVED Slave can`t connect via JNLP if Jenkins behind the balancer
  • JENKINS-51817 RESOLVED NPE throw in RemotableSVNErrorMessage due to wrong usage of C'tors
  • JENKINS-51816 RESOLVED 'Instance Configuration' step displays request result
  • JENKINS-51802 IN PROGRESS The unzip steps is vulnerabe to zip slip (unpacks outside target directory)
  • JENKINS-51801 OPEN Getting java.io.IOException: Expecting Ant GLOB pattern error while providing build path in Jenkins. I am configuring build deployment on Hockey app using Jenkins!
  • JENKINS-51800 IN REVIEW Infinite loop / Stack overflow when using a specific setter in pipeline
  • JENKINS-51799 OPEN When using SLOCcount plugin to vizualize two different xml reports it shows data from only one report in two graphics
  • JENKINS-51798 RESOLVED GoogleTest parse error when time attribute is missing
  • JENKINS-51797 RESOLVED xUnit.Net v2 parse error when time attribute is missing
  • JENKINS-51796 CLOSED Installs: No usage data available
  • JENKINS-51794 OPEN Multiple builds start from the same commit
  • JENKINS-51793 REOPENED Unable to save configuration changes after upgrading from 2.36 to 2.107.3
  • JENKINS-51792 OPEN Incorrect Jenkinsfile with >1 steps section produces unclear error about `default` branch name
  • JENKINS-51791 OPEN git polling fails to detect changes when build uses multiple repos
  • JENKINS-51790 OPEN Support GTest Disabled Tests in Junit Plugin
  • JENKINS-51779 RESOLVED Use of beta Guava method since deleted: Iterators.skip
  • JENKINS-51777 RESOLVED tar 아카이브 용 "zip-slip"수정.
  • JENKINS-51776 CLOSED 소스 OnDemand 플러그인 1.175 이상이 포함 된 com.google.inject.CreationException
  • JENKINS-51775 OPEN 에이전트의 각 인스턴스에 대해 작성된 새 ECS 태스크 정의가 요청되었습니다.
  • JENKINS-51774 OPEN testlink 반복 빌드 단계를 실행하고 보고서를 생성 할 수 없습니다.
  • JENKINS-51772 OPEN 소스 랩 테스트 게시자 실패
  • JENKINS-51770 FIXED BUT UNRELEASED 자격 증명을 찾을 수 없습니다.
  • JENKINS-51769 OPEN 404 움라우트로 작업 이름 바꾸기
  • JENKINS-51767 RESOLVED xUnit 2.x XSD가 NUnit 2.x XML 보고서 파일의 유효성을 검사하지 않습니다.
  • JENKINS-51765 OPEN 대상 분기가 업데이트 된 후 PR이 다시 작성되지 않습니다.
  • JENKINS-51763 OPEN dockerfile에 제공된 자격 증명 숨기기
  • JENKINS-51762 OPEN 마지막 작업을 나열 할 때 일부 작업에서 NullPointerException이 발생합니다.
  • JENKINS-51761 OPEN p4 플러그인이 인증에 실패했습니다.
  • JENKINS-51760 jenkins REOPENED 에서 일자리 비활성화 날짜 가져 오기 API
  • JENKINS-51759 IN PROGRESS 풀 요청에 Jenkinsfile을로드 할 수 없습니다.
  • JENKINS-51758 OPEN groovy / jenkinsfile을 통해 vsphere 플러그인 아래에 새로운 vsphere 템플릿을 등록하십시오.
  • JENKINS-51757 CLOSED Jenkins의 홈 디렉토리를 chaging 한 후 htmlpublisher 플러그인이 / home / jenkins라는 새 경로가 아닌 이전 디렉토리에 보관합니다.
  • JENKINS-51756 OPEN 사용할 수없는 포트로 인해 SauceConnect가 시작되지 않습니다.
  • JENKINS-51755 OPEN SCM-TeamConcert : 플러그인이 UUID를 통해 작업 영역을 찾을 수 없습니다.
  • JENKINS-51754 OPEN Jenkins 1.651.3에서 2.107.3으로 업그레이드
  • JENKINS-51753 OPEN SCM-TeamConcert : 빌드 플래그 이전에 최신 변경 내용을 적용하여 해당 작업 영역에 대해 빌드를 실행하면 보내는 변경 집합이 삭제됩니다.
  • JENKINS-51750 OPEN 구성 파일 제공자가 파일을 파이프 라인으로 복사하지 않는다.
  • JENKINS-51746 OPEN 작업 가져 오기 플러그인이 작업을 가져 오지 않습니다.
  • JENKINS-51745 푸른 바다에서 OPEN 잘못된 경과 시간 표시
  • JENKINS-51744 OPEN 예약 된 작업이 없습니다.
  • JENKINS-51743 Jitkins CLOSED 작업이 gitlab 병합 요청에서 트리거되지 않습니다.
  • JENKINS-51741 OPEN [jep-200] http-request-plugin
  • JENKINS-51734 OPEN sessionTimeout을 준수 하지 않습니다.
  • JENKINS-51729 RESOLVED Getting "jenkinsapi.custom_exceptions.UnknownJob:" exception during python jenkins api call
  • JENKINS-51728 RESOLVED FSTrigger plugin affected by JEP-200
  • JENKINS-51727 OPEN Pipeline bat stuck on Windows Server when mixed agents used
  • JENKINS-51726 OPEN Slave failed to connect to http/2 Master
  • JENKINS-51724 OPEN WorkspaceCleanupThread may delete workspaces for parallel-running AbstractProject builds
  • JENKINS-51723 OPEN NPE in smart-jenkins-plugin's ComputerListener
  • JENKINS-51722 RESOLVED Error in logs using properties pipeline syntax
  • JENKINS-51720 RESOLVED Improper groupId in the Remoting Kafka Plugin
  • JENKINS-51719 OPEN javax.servlet.ServletException: org.apache.commons.jelly.JellyTagException
  • JENKINS-51716 OPEN Blueocean stuck in loading
  • JENKINS-51715 CLOSED Proxy settings are not honored by the Google Compute Engine Plugin
  • JENKINS-51706 OPEN Parameterized build always triggered even w/o SCM changes
  • JENKINS-51704 OPEN Jenkins Gauva library conflicting with Play Framework
  • JENKINS-51703 RESOLVED Performance Plugin: Failed to serialize hudson.plugins.performance.parsers.AbstractParser#dateFormat for class hudson.plugins.performance.parsers.JMeterCsvParser
  • JENKINS-51701 IN REVIEW ghfgh
  • JENKINS-51700 OPEN Cannot run command on other agent/master when global agent is kubernetes
  • JENKINS-51698 OPEN Failed to check out svn ....svn: E200030: FULL
  • JENKINS-51697 OPEN Next Executions plugin does not honor cron schedule's timezone
  • JENKINS-51696 OPEN Builds randomly fail on Kubernetes
  • JENKINS-51695 RESOLVED ssh-add fails randomly on Kubernetes
  • JENKINS-51692 OPEN Cannot logout from the Google Login plugin
  • JENKINS-51691 CLOSED JEP-200 Compatibility failing to serialize packages needed for successfully passing java pipeline triggered by push on Gitlab
  • JENKINS-51690 CLOSED Can't add any more item roles
  • JENKINS-51689 OPEN Path problems when using sh of git for windows
  • JENKINS-51688 OPEN hudson.remoting.ProxyException: groovy.lang.MissingMethodException: No signature of method: [LStatus;.getAt() is applicable for argument types: (java.lang.Integer)
  • JENKINS-51687 OPEN NPE when upgrading global build stats plugin
  • JENKINS-51686 CLOSED SSO is not working after upgrading to new versions
  • JENKINS-51685 RESOLVED /var/lib/jenkins/init.groovy.d/create-github-oauth.groovy fails on initialisation
  • JENKINS-51683 OPEN credential bindings and param during import
  • JENKINS-51681 CLOSED Jenkins job hangs while running pdflatex inside .bat
  • JENKINS-51680 OPEN Infinity Build Loop
  • JENKINS-51679 IN PROGRESS git config not shown when configuring more the one shared library
  • JENKINS-51678 RESOLVED checkUpdateServer problem
  • JENKINS-51677 IN PROGRESS Credentials are ignored for shared libraries
  • JENKINS-51676 OPEN HPE Performance plugin not working fine
  • JENKINS-51674 CLOSED Folder icon is not showing in compiler warnings icon list
  • JENKINS-51673 IN PROGRESS PollSCM runs again when job on commit takes longer then the trigger
  • JENKINS-51671 OPEN JiraTestResultReporter-plugin does not work with Maven projects with modules
  • JENKINS-51670 OPEN java.io.IOException: Failed to connect to 18.218.111.188:33083
  • JENKINS-51669 RESOLVED Jenkins POM: "mvn clean deploy" stopped working in Jenkins 2.125+ and (?) Parent POM 1.46 +
  • JENKINS-51664 OPEN file.separator is returning / on Windows.
  • JENKINS-51663 RESOLVED BuildNameSetter Plugin failing serialization
  • JENKINS-51662 OPEN Build Current Patches Only aborts builds after triggered by patchset with no code change
  • JENKINS-51661 CLOSED Guice error when installing via `install-plugins.sh`
  • JENKINS-51660 RESOLVED Setup wizard suggests root URL not ending in slash
  • JENKINS-51656 RESOLVED CWP: Add support of CasC plugin YAML as a configuration input
  • JENKINS-51655 OPEN Docker Agent Template options break job configure page
  • JENKINS-51654 OPEN Performance low with Jenkins core
  • JENKINS-51653 OPEN f:number + doCheckXxx trigger two requests on init
  • JENKINS-51652 OPEN java.lang.RuntimeException: java.lang.RuntimeException: com.microsoft.tfs.core.exceptions.TECoreException: The SOAP endpoin
  • JENKINS-51651 RESOLVED Upgrade jenkins
  • JENKINS-51650 RESOLVED RunParameterDefinition.copyWithDefaultValue() used wrong constructor
  • JENKINS-51649 OPEN Configuration for the update policies are not loaded correctly in Repository Connector Plugin
  • JENKINS-51646 CLOSED Pipeline does not resolve credentials symlinks
  • JENKINS-51644 OPEN EC2 Plugin doesn't support c5d Instance Types
  • JENKINS-51643 CLOSED Kubernetes plugin doesn't respect privileged=true in jnlp container
  • JENKINS-51641 IN PROGRESS Duplicate commits displayed on Pipeline build when using "Poll SCM" and "Pipeline script from SCM"
  • JENKINS-51639 OPEN push hook handler hangs timer thread when having network hiccups
  • JENKINS-51638 OPEN No Enum Constant Found - Default PreBuildMerge Failure
  • JENKINS-51636 OPEN No pipeline when branch name contains space
  • JENKINS-51635 OPEN S3 Plugin doesn't respect Jenkins exclude proxy settings
  • JENKINS-51634 RESOLVED java.lang.RuntimeException: Failed to serialize hudson.model.Actionable#actions for class hudson.model.FreeStyleBuild java.lang.UnsupportedOperationException:
  • JENKINS-51631 OPEN Jenkins Plugin micro focus rebranding
  • JENKINS-51630 OPEN Setup Wizard 'Create Admin User' skip button does not transition to the next state
  • JENKINS-51629 OPEN Jira : Create issue is not working
  • JENKINS-51628 OPEN Simultaneous Maven builds fail with bad class file: corrupted zip file while getting local dependency jar
  • JENKINS-51627 CLOSED remove "Try Blue" action hacks
  • JENKINS-51625 CLOSED org.jfrog.build.api.Artifact issue not solved!
  • JENKINS-51624 OPEN Not able to get the jenkins agent as live on Jenkins Dashboard - Google Compute Plugin
  • JENKINS-51623 CLOSED arachni-scanner-plugin is affected by fix for JEP-200
  • JENKINS-51622 RESOLVED Incompatible with Gradle 4.8
  • JENKINS-51621 CLOSED Login failed when trying to integrate ALM12.53 with jenkins
  • JENKINS-51620 OPEN generateLicenseInfo fails with ivy repositories
  • JENKINS-51617 IN PROGRESS Jenkins outputs multiple "Â" when setting it up with apache reverse proxy
  • JENKINS-51615 OPEN Docker Compose with Amazon ECR Not Working on Remote Server
  • JENKINS-51612 OPEN Rocket Chat notification send fails if two jobs try to send one at the same time
  • JENKINS-51610 OPEN Kubernetes-plugin and namespaces
  • JENKINS-51608 RESOLVED ClassicPluginStrategy#getShortName() does not offer diagnostics about failure reasons
  • JENKINS-51607 IN PROGRESS Build-Blocker-Plugin - Does not block Pipeline
  • JENKINS-51606 OPEN Jenkins 2.125 및 HP ALM12.21 OTA에 대한 OTA 연결 문제 (4848)
  • JENKINS-51605 OPEN 파이프 라인 스테이지 뷰가 갑자기 사라집니다. 리소스를로드하지 못했습니다.
  • JENKINS-51604 RESOLVED 테스트에 여러 인시던트가 포함되어있을 때 QtTestLib를 파싱 할 때의 XPathExeption
  •   RESOLVEDJNLPLauncher 요구 사항의 JENKINS-51603 workDirSettings가 너무 엄격합니다. CasC 플러그인이 영향을받습니다.
  • JENKINS-51602 OPEN 색조 라이트 플러그인은 Jenkins 2.102+ (JEP-200)과 호환되지 않습니다.
  • JENKINS-51601 Logstash에 RESOLVED 개별 로그 라인 보내기
  • JENKINS-51600 CLOSED 빌드 우선 순위 지정 플러그인을 통해 사용 가능한 실행 프로그램이있는 경우에도 Jenkins 대기열이 멈추는 문제
  • JENKINS-51596 OPEN 이 빌드를 영원히 유지 / 유지하지 않을 때의 예외 보고서
  • JENKINS-51594 IN PROGRESS 증분 버전과 스냅 샷 비교 비교
  • JENKINS-51592 CLOSED svnkit 유틸리티가 소켓 스트림 요청으로 jenkins 작업자에게 무기한 정지합니다.
  • JENKINS-51591 OPEN 반복적 인 심볼릭 링크로 인해 노드 디스크 모니터링이 중단 될 수 있습니다.
  • JENKINS-51590 RESOLVED 데이터 수집 java.lang.ArithmeticException 발생 :
  • JENKINS-51588 RESOLVED 하나의 입력 파일이 비어 있으면 경고 플러그인이 빌드 상태를 설정하지 않습니다.

태스크

  • JENKINS-52589 OPEN 글로벌 보안을 구성 할 수 없습니다.
  • JENKINS-52588 OPEN 1.0 SPRP 용 블로그 게시물 만들기
  • JENKINS-52581 OPEN CI에서 기본 AWS flavor 테스트를 자동으로 실행합니다.
  • JENKINS-52580 aloting OPEN 버전의 remoting-kafka-agent 게시
  • JENKINS-52569 OPEN 엔드 유저 문서를 작성하여 인스턴스를 시작합니다 (도커 및 aws)
  • JENKINS-52557 CLOSED POM 파일에서 개발자 업데이트
  • JENKINS-52556 CLOSED 마이크로 포커스 리 브랜딩
  • JENKINS-52539 jenkins.io의 OPEN 프로젝트 문서 업데이트
  • JENKINS-52527 OPEN 보초 통합을 조롱하는 단위 테스트 추가
  • JENKINS-52526 IN PROGRESS 상록 배포 용 마이그레이션 생성 컨테이너 만들기
  • JENKINS-52525 OPEN switchinig evergreen-client가 socket.io 메시징을 엄격하게 사용하는지 조사합니다.
  • JENKINS-52515 RESOLVED Remoting Kafka 프리젠 테이션 비디오 / 슬라이드에 대한 링크를 README에 추가하십시오.
  • JENKINS-52514 OPEN Remoting 설명서에 Remoting Kafka 구현에 대한 정보 추가
  • JENKINS-52503 OPEN day01
  • JENKINS-52494 IN REVIEW ATH 컨테이너에서 업그레이드 된 Selenium, Chrome 사용을 통한 실험
  • JENKINS-52488 OPEN Mac OS에서 확인 확인 실패
  • JENKINS-52479 OPEN junit xml 여러 개의 테스트 결과 파일을 가져올 수있는 솔루션을 찾고 있습니다.
  • JENKINS-52474 .groovy OPEN 구성을 작성하는 방법을 설명하는 문서를 추가하십시오.
  • JENKINS-52471 RESOLVED 최신 배포 빌드에서 npm이 누락되었습니다.
  • JENKINS-52470 CLOSED 최소 젠킨스 버전 및 자바 레벨 올리기
  • JENKINS-52458 OPEN 기본 키에 대한 시퀀스 ID 대신 guid 를 사용하도록 모든 데이터베이스 테이블을 업데이트하십시오.
  • JENKINS-52457 OPEN 모델 정의와 일치하도록 데이터베이스 업데이트
  • JENKINS-52455 CLOSED EC2 에이전트에 대해 JNLP 포트 50000을 노출하지 마십시오.
  • JENKINS-52445 CLOSED Modify Jenkinsfile to work in internal builds
  • JENKINS-52433 CLOSED Add Jenkinsfile to the plugin
  • JENKINS-52431 OPEN Octane rebranding part (userstory #649003)
  • JENKINS-52428 RESOLVED PCT fails when plugin to test is not on context
  • JENKINS-52426 RESOLVED Blog update on AWS flavor
  • JENKINS-52413 OPEN My First Test
  • JENKINS-52412 OPEN MockUpdateCenter does not proxy file:// based URLs
  • JENKINS-52389 OPEN If jenkins does not start within 10 seconds it causes test failures
  • JENKINS-52375 RESOLVED Test Jenkins connection
  • JENKINS-52372 OPEN defect #663077: fixing the logic of proxy resolution to work on host and not on the full URL
  • JENKINS-52371 OPEN correctly handling potential NPE during Jenkins startup
  • JENKINS-52370 OPEN user story #651006 : [UFT integration]Move common logic related to UFT integration to sdk
  • JENKINS-52356 OPEN support 64bit files in ZipArchiver
  • JENKINS-52352 CLOSED Backward compatibility for jobs after package name change
  • JENKINS-52322 OPEN Jenkins jacoco plugin fails to when running on slave machines
  • JENKINS-52315 RESOLVED Update Jenkinsfile in the core to test with Java 10 in CI
  • JENKINS-52312 OPEN Release Candidate Testing; Run PCT against plugins recommended in the Jenkins installation wizard
  • JENKINS-52310 OPEN Release Candidate Testing: Run BlueOcean ATH of Jenkins WAR with Java 10 support
  • JENKINS-52309 OPEN Release Candidate Testing: Run ATH of Jenkins WAR with Java 10 support
  • JENKINS-52295 RESOLVED Upgrade to LTS 2.121.1
  • JENKINS-52280 OPEN Create official Java 10/11 Docker Packaging for BlueOcean
  • JENKINS-52279 OPEN Create Dockerfiles for Java 10/11 jenkins/ssh-slave images
  • JENKINS-52248 IN PROGRESS Create JEP for Java 10+ support in Jenkins
  • JENKINS-52247 OPEN Support Outlook.com, GMail and other public e-mail providers in mailer plug-in
  • JENKINS-52231 IN PROGRESS Cant caccess Global tool configuration
  • JENKINS-52210 IN PROGRESS Write JEP about AWS auto-configuration
  • JENKINS-52208 OPEN Fix FindBugs violations
  • JENKINS-52196 CLOSED Publish evergreen backend image
  • JENKINS-52194 RESOLVED Publish the backend container
  • JENKINS-52191 RESOLVED Create jenkinsciinfra/evergreen-backend repository on Docker Hub
  • JENKINS-52188 RESOLVED Java 10+: Upstream BCT patches to weekly releases
  • JENKINS-52187 IN PROGRESS Java 10+: Upstream the Pipeline: Support patches
  • JENKINS-52186 OPEN Java 10+: Upstream the JAXB bundling to the master branch
  • JENKINS-52185 OPEN Java 10+: Upstream the Groovy 2.4.12 update to the master branch
  • JENKINS-52178 OPEN Investigate impact of self-attach flag requirement (Java 9+) on Jenkins plugins
  • JENKINS-52163 RESOLVED Standardize acceptance test assertions to use jest's expect
  • JENKINS-52161 RESOLVED [API token] Manage Legacy API Token usage UX date since use labeling should be restructured
  • JENKINS-52155 RESOLVED upgrade default animal sniffer plugin to 1.17
  • JENKINS-52143 RESOLVED Add JSON validation for all acceptance tests for JEP-308
  • JENKINS-52137 OPEN Explore Remoting Kafka end-to-end encryption options
  • JENKINS-52122 RESOLVED Enrich distro smoke tests to check essentials and metrics plugins are there
  • JENKINS-52096 RESOLVED Exploratory testing of Java 10/11 WARs
  • JENKINS-52083 CLOSED Investigate InjectedTest errors when running plugin tests in the PCT on Java 11
  • JENKINS-52081 IN PROGRESS create an Epic for phase 3
  • JENKINS-52052 OPEN Investigate bouncycastle-related errors when running JenkinsRule tests on Java 11
  • JENKINS-52050 RESOLVED Prototype EC2 agents to get a feeling of what is needed for auto-configuration
  • JENKINS-52049 CLOSED Prototype ECS agents to get a feeling of what is needed for auto-configuration
  • JENKINS-52035 OPEN (Jenkins integration with HP PC for Perf testing)Jenkins doesnt show raw results or complete analysis file , it only shows HTML file as result.
  • JENKINS-52032 OPEN Replace slave occurrence by agent in the Amazon ECS plugin
  • JENKINS-52031 RESOLVED user story #622117 : UFT integration - add to discovery job configuration - add timestamps to the console output
  • JENKINS-52030 RESOLVED user story #623123 : UFT integration - rename test in the repository
  • JENKINS-52013 OPEN Switch Java 10 and 11 branches to common UC by default
  • JENKINS-51987 OPEN Create Dockerfiles for Java 11 jenkins/slave and jenkins/jnlp-slave images
  • JENKINS-51986 OPEN Create Dockerfiles for Java 10 jenkins/slave and jenkins/jnlp-slave images
  • JENKINS-51985 OPEN Create official jenkins/jenkins Docker images for Java 10 and 11 versions
  • JENKINS-51984 CLOSED cleanup if statements in snippet generator
  • JENKINS-51976 OPEN Load Runner Scenario not being picked up during the job run
  • JENKINS-51956 RESOLVED upgrade blue-ocean to plugins parent 3.15
  • JENKINS-51942 RESOLVED Improve Kafka producer-consumer topic model
  • JENKINS-51938 OPEN After updating jenkins....its show this warning to me..... [WARNING] Attempt to (de-)serialize anonymous class hudson.maven.reporters.SurefireArchiver$2; see: https://jenkins.io/redirect/serialization-of-anonymous-classes/ what can i do now?
  • JENKINS-51903 OPEN Add testing on Java 10 to the core's Pipeline
  • JENKINS-51899 RESOLVED Create guidelines for running Jenkins on Java 10 and Java 11
  • JENKINS-51886 CLOSED Handling expired kubeconfig
  • JENKINS-51882 IN PROGRESS when github-branch-source plugin is used to manage multibranch then Octane should auto manage pipeline (same as pipeline multibranch plugin)
  • JENKINS-51881 IN PROGRESS :when branch is deleted then the corresponding pipeline in octane should be deleted
  • JENKINS-51877 OPEN 주어진 환경 (Docker, Azure, AWS ...)에 대한 자동 구성에 관한 JEP 작성
  • JENKINS-51868 CLOSED 일일 업데이트 용 Google 문서 만들기
  • JENKINS-51860 OPEN 로그 전달을 수정하고 로그를 향상시킵니다.
  • JENKINS-51851 OPEN 자동 감지를위한 제외 경로 추가
  • JENKINS-51839 RESOLVED Java 10과의 원격 호환성 확인
  • JENKINS-51825 RESOLVED Jenkins 파이프 라인과 Java 10의 호환성 확인
  • JENKINS-51824 IN PROGRESS Java 10과 스크립트 보안 호환성 조사
  • JENKINS-51823 OPEN Groovy 업데이트를 2.4.11에서 3.0+
  • JENKINS-51822 OPEN Remoting에서 Java 11 Selector 논리 변경의 영향 조사
  • JENKINS-51821 RESOLVED Java 11에서 Jenkins Core의 Java EE 제거 효과 살펴보기
  • JENKINS-51820 OPEN 코어에서 Java Web Start UI 및 로직 분리
  • JENKINS-51815 RESOLVED dev 분기에 UI 분기 병합
  • JENKINS-51813 IN PROGRESS 플러그인 테스트 작성
  • JENKINS-51812 CLOSED 평가판 용 플러그인 데모 준비
  • JENKINS-51810 RESOLVED 2 단계를위한 EPIC 만들기, 거기서 몇 가지 작업 이동하기
  • JENKINS-51795 RESOLVED 소스를 재구성하여 서비스와 "클라이언트"측면을 명확히합니다.
  • JENKINS-51789 CLOSED 2 단계에서 EPIC를 작성하고 거기에서 완료하지 않을 작업을 이동하십시오.
  • JENKINS-51788 RESOLVED 샘플 YAML로 데모 저장소 만들기
  • JENKINS-51787 CLOSED archiveArtifacts () 단계의 지원 추가
  • JENKINS-51786 CLOSED junit () 단계의 지원 추가
  • JENKINS-51785 CLOSED 빌드에 대한 스펙을 작성할 수있는 사용자를 사용하여 적절한 YAML 형식을 설계하십시오.
  • JENKINS-51784 CLOSED 프로세스를 빌드하고 구현하는 데 필요한 빌드 매개 변수를 전달하는 방법을 결정하십시오.
  • JENKINS-51781 RESOLVED 프로젝트 소개 및 프로토 타입 개요 / 데모로 블로그 포스트 작성
  • JENKINS-51780 RESOLVED 평가판 용 플러그인 데모 준비
  • JENKINS-51778 IN PROGRESS CWP로 구동되는 새로운 ELK 외부 로깅 데모 만들기
  • JENKINS-51773 OPEN SSH 플러그인 게시를 사용하여 maven 프로젝트에서 Linux 시스템으로 전쟁을 내보낼 수 없습니다.
  • JENKINS-51766 IN PROGRESS 등록하는 동안 풍미를 저장하고 그것에 따라 다른 명단을 제공하십시오
  • JENKINS-51752 RESOLVED 클라이언트의 버전에 따라 업데이트 매니페스트를 계산해야합니다.
  • JENKINS-51740 RESOLVED 코드 커버리지 API 플러그인 알파 버전 출시
  • JENKINS-51739 OPEN 백 로그 검토 및 문제 우선 순위 지정
  • JENKINS-51735 IN REVIEW Sentry에 프로토 타입 전달 오류 로깅
  • JENKINS-51733 IN PROGRESS 채택 된 코드의 리 팩터링
  • JENKINS-51732 IN PROGRESS 코드 적용 형식을 추가하는 옵션 조사
  • JENKINS-51731 RESOLVED 독립 실행 형 파이프 라인을 실행하면 즉시 실행 가능해야합니다.
  • JENKINS-51714 OPEN 플러그인의 기본 테스트 자동화
  • JENKINS-51713 RESOLVED 플러그인의 알파 릴리스
  • JENKINS-51712 OPEN 여러 명인이 카프카를 공유하는 방법을 조사합니다.
  • JENKINS-51707 CLOSED 실패 - java.net.SocketException : 연결 재설정
  • JENKINS-51665 RESOLVED travel_agency
  • JENKINS-51626 RESOLVED 링크는 소문자 이름을 생성 / 적용합니다 (camelCase 구문 제거).
  • JENKINS-51616 RESOLVED Issue1
  • JENKINS-51614 RESOLVED Docker 플러그인 연결 방법 문서 강화
  • JENKINS-51599 독점 RESOLVED 플러그인 증분
  • JENKINS-51589 OPEN "다른 프로젝트에서 트리거 매개 변수화 된 빌드"가 대기열을 해제하지 않습니다.

이야기

  • JENKINS-52301 OPEN [SRF] 젠킨스 플러그인의 문자열 수정 - 리 브랜딩 포함
  • JENKINS-52300 OPEN [SRF] 업데이트보기 설정 도움말 설명
  • JENKINS-52299 OPEN [SRF] SRF 공통 설정의 연결 테스트는 클라이언트의 ID와 암호를 검증해야합니다.
  • JENKINS-51915 OPEN REST API를 사용하여 로컬 그룹을 얻는 방법
  • JENKINS-51906 RESOLVED 로컬로 생성 된 그룹 (젠킨스 그룹)
  • JENKINS-51883 OPEN 그룹 목록을 가져 오는 REST API
  • JENKINS-51647 OPEN SSH에 연결하는 동안 오류가 발생했습니다.